Started by upstream project "autoplot-run-tests" build number 11482
originally caused by:
Started by upstream project "autoplot-all" build number 11421
originally caused by:
Started by timer
Started by upstream project "autoplot-all" build number 11421
Running as SYSTEM
Building in workspace /var/local/jenkins/workspace/autoplot-test038
[autoplot-test038] $ /bin/sh -xe /tmp/jenkins3287920219342637782.sh
+ rm -f Test038.java test038.addPointDigitizer.jy.cdf test038.background_removal_wfr.jyds.cdf test038.demoParms.jy.cdf test038.demoParms0.jy.cdf test038.demoParms1.jy.cdf test038.demoParms2.jy.cdf test038.exDataSets.jyds.cdf test038.fce_A.jyds.cdf test038.fce_A_2.jyds.cdf test038.jedi_l3_valid_tofxe_events.jyds.cdf test038.jydsCommentBug.jyds.cdf test038.rewriteF_L0.jy.cdf test038.trivial.jy.cdf test038.txt test038.windlistener.jy.cdf test038_completions_addPointDigitizer.jy test038_completions_addPointDigitizer.jy.png test038_completions_background_removal_wfr.jyds test038_completions_background_removal_wfr.jyds.png test038_completions_demoParms.jy test038_completions_demoParms.jy.png test038_completions_demoParms0.jy test038_completions_demoParms0.jy.png test038_completions_demoParms1.jy test038_completions_demoParms1.jy.png test038_completions_demoParms2.jy test038_completions_demoParms2.jy.png test038_completions_exDataSets.jyds test038_completions_exDataSets.jyds.png test038_completions_fce_A.jyds test038_completions_fce_A.jyds.png test038_completions_fce_A_2.jyds test038_completions_fce_A_2.jyds.png test038_completions_jedi_l3_valid_tofxe_events.jyds test038_completions_jedi_l3_valid_tofxe_events.jyds.png test038_completions_jydsCommentBug.jyds test038_completions_jydsCommentBug.jyds.png test038_completions_rewriteF_L0.jy test038_completions_rewriteF_L0.jy.png test038_completions_trivial.jy test038_completions_trivial.jy.png test038_completions_windlistener.jy test038_completions_windlistener.jy.png test038_params_addPointDigitizer.jy test038_params_background_removal_wfr.jyds test038_params_demoParms.jy test038_params_demoParms0.jy test038_params_demoParms1.jy test038_params_demoParms2.jy test038_params_exDataSets.jyds test038_params_fce_A.jyds test038_params_fce_A_2.jyds test038_params_jedi_l3_valid_tofxe_events.jyds test038_params_jydsCommentBug.jyds test038_params_rewriteF_L0.jy test038_params_trivial.jy test038_params_windlistener.jy
+ export DISPLAY=localhost:2
+ JAR=../autoplot-jar-all/autoplot/Autoplot/dist/AutoplotAll.jar
+ cp ../autoplot-jar-all/autoplot/Autoplot/temp-src/test/endtoend/Test038.java .
+ /usr/local/jdk1.8//bin/java -cp ../autoplot-jar-all/autoplot/Autoplot/dist/AutoplotAll.jar test.endtoend.Test038
== test 002: /home/jbf/ct/hudson/script/test038/demoParms1.jy ==
src=rbsp
pub=ECT
pub2=ECT
read params in 288 millis: /home/jbf/ct/hudson/script/test038/demoParms1.jy
== test 002: /home/jbf/ct/hudson/script/test038/demoParms1.jy ==
src=rbsp
pub=ECT
pub2=ECT
read params in 22 millis: /home/jbf/ct/hudson/script/test038/demoParms1.jy
== test 002: /home/jbf/ct/hudson/script/test038/demoParms1.jy ==
overwriting /var/local/jenkins/workspace/autoplot-test038/test038.demoParms1.jy.cdf
overwriting /var/local/jenkins/workspace/autoplot-test038/test038.demoParms1.jy.cdf
overwriting /var/local/jenkins/workspace/autoplot-test038/test038.demoParms1.jy.cdf
== first initialize in 14 millis
== test 112: /home/jbf/ct/hudson/script/test038/windlistener.jy ==
read params in 22 millis: /home/jbf/ct/hudson/script/test038/windlistener.jy
== test 112: /home/jbf/ct/hudson/script/test038/windlistener.jy ==
read params in 13 millis: /home/jbf/ct/hudson/script/test038/windlistener.jy
== test 112: /home/jbf/ct/hudson/script/test038/windlistener.jy ==
Oct 01, 2026 1:21:52 PM org.das2.jythoncompletion.JythonCompletionTask queryMethods
SEVERE: null
Traceback (innermost last):
(no code object) at line 0
TypeError: write only attribute
at org.python.core.Py.TypeError(Py.java:157)
at org.python.core.PyBeanEvent._doget(PyBeanEvent.java:17)
at org.python.core.PyObject._doget(PyObject.java:1103)
at org.python.core.PyObject.__get__(PyObject.java:2981)
at org.python.core.PyInstance.__findattr__(PyInstance.java:212)
at org.python.core.PyInstance.__findattr__(PyInstance.java:201)
at org.python.core.PyObject.__getattr__(PyObject.java:984)
at org.das2.jythoncompletion.JythonCompletionTask.queryMethods(JythonCompletionTask.java:417)
at org.das2.jythoncompletion.JythonCompletionTask.doQuery(JythonCompletionTask.java:186)
at test.endtoend.Test038.getCompletionsCount(Test038.java:136)
at test.endtoend.Test038.doTestsCountCompletions(Test038.java:174)
at test.endtoend.Test038.doTests(Test038.java:58)
at test.endtoend.Test038.testGetParams(Test038.java:276)
at test.endtoend.Test038.main(Test038.java:303)
Oct 01, 2026 1:21:52 PM org.das2.jythoncompletion.JythonCompletionTask queryMethods
SEVERE: null
Traceback (innermost last):
(no code object) at line 0
TypeError: write only attribute
at org.python.core.Py.TypeError(Py.java:157)
at org.python.core.PyBeanEvent._doget(PyBeanEvent.java:17)
at org.python.core.PyObject._doget(PyObject.java:1103)
at org.python.core.PyObject.__get__(PyObject.java:2981)
at org.python.core.PyInstance.__findattr__(PyInstance.java:212)
at org.python.core.PyInstance.__findattr__(PyInstance.java:201)
at org.python.core.PyObject.__getattr__(PyObject.java:984)
at org.das2.jythoncompletion.JythonCompletionTask.queryMethods(JythonCompletionTask.java:417)
at org.das2.jythoncompletion.JythonCompletionTask.doQuery(JythonCompletionTask.java:186)
at test.endtoend.Test038.getCompletionsCount(Test038.java:136)
at test.endtoend.Test038.doTestsCountCompletions(Test038.java:174)
at test.endtoend.Test038.doTests(Test038.java:58)
at test.endtoend.Test038.testGetParams(Test038.java:276)
at test.endtoend.Test038.main(Test038.java:303)
Oct 01, 2026 1:21:52 PM org.das2.jythoncompletion.JythonCompletionTask queryMethods
SEVERE: null
Traceback (innermost last):
(no code object) at line 0
TypeError: write only attribute
at org.python.core.Py.TypeError(Py.java:157)
at org.python.core.PyBeanEvent._doget(PyBeanEvent.java:17)
at org.python.core.PyObject._doget(PyObject.java:1103)
at org.python.core.PyObject.__get__(PyObject.java:2981)
at org.python.core.PyInstance.__findattr__(PyInstance.java:212)
at org.python.core.PyInstance.__findattr__(PyInstance.java:201)
at org.python.core.PyObject.__getattr__(PyObject.java:984)
at org.das2.jythoncompletion.JythonCompletionTask.queryMethods(JythonCompletionTask.java:417)
at org.das2.jythoncompletion.JythonCompletionTask.doQuery(JythonCompletionTask.java:186)
at test.endtoend.Test038.getCompletionsCount(Test038.java:136)
at test.endtoend.Test038.doTestsCountCompletions(Test038.java:174)
at test.endtoend.Test038.doTests(Test038.java:58)
at test.endtoend.Test038.testGetParams(Test038.java:276)
at test.endtoend.Test038.main(Test038.java:303)
Oct 01, 2026 1:21:52 PM org.das2.jythoncompletion.JythonCompletionTask queryMethods
SEVERE: null
Traceback (innermost last):
(no code object) at line 0
TypeError: write only attribute
at org.python.core.Py.TypeError(Py.java:157)
at org.python.core.PyBeanEvent._doget(PyBeanEvent.java:17)
at org.python.core.PyObject._doget(PyObject.java:1103)
at org.python.core.PyObject.__get__(PyObject.java:2981)
at org.python.core.PyInstance.__findattr__(PyInstance.java:212)
at org.python.core.PyInstance.__findattr__(PyInstance.java:201)
at org.python.core.PyObject.__getattr__(PyObject.java:984)
at org.das2.jythoncompletion.JythonCompletionTask.queryMethods(JythonCompletionTask.java:417)
at org.das2.jythoncompletion.JythonCompletionTask.doQuery(JythonCompletionTask.java:186)
at test.endtoend.Test038.getCompletionsCount(Test038.java:136)
at test.endtoend.Test038.doTestsCountCompletions(Test038.java:174)
at test.endtoend.Test038.doTests(Test038.java:58)
at test.endtoend.Test038.testGetParams(Test038.java:276)
at test.endtoend.Test038.main(Test038.java:303)
Oct 01, 2026 1:21:52 PM org.das2.jythoncompletion.JythonCompletionTask queryMethods
SEVERE: null
Traceback (innermost last):
(no code object) at line 0
TypeError: write only attribute
at org.python.core.Py.TypeError(Py.java:157)
at org.python.core.PyBeanEvent._doget(PyBeanEvent.java:17)
at org.python.core.PyObject._doget(PyObject.java:1103)
at org.python.core.PyObject.__get__(PyObject.java:2981)
at org.python.core.PyInstance.__findattr__(PyInstance.java:212)
at org.python.core.PyInstance.__findattr__(PyInstance.java:201)
at org.python.core.PyObject.__getattr__(PyObject.java:984)
at org.das2.jythoncompletion.JythonCompletionTask.queryMethods(JythonCompletionTask.java:417)
at org.das2.jythoncompletion.JythonCompletionTask.doQuery(JythonCompletionTask.java:186)
at test.endtoend.Test038.getCompletionsCount(Test038.java:136)
at test.endtoend.Test038.doTestsCountCompletions(Test038.java:174)
at test.endtoend.Test038.doTests(Test038.java:58)
at test.endtoend.Test038.testGetParams(Test038.java:276)
at test.endtoend.Test038.main(Test038.java:303)
Oct 01, 2026 1:21:52 PM org.das2.jythoncompletion.JythonCompletionTask queryMethods
SEVERE: null
Traceback (innermost last):
(no code object) at line 0
TypeError: write only attribute
at org.python.core.Py.TypeError(Py.java:157)
at org.python.core.PyBeanEvent._doget(PyBeanEvent.java:17)
at org.python.core.PyObject._doget(PyObject.java:1103)
at org.python.core.PyObject.__get__(PyObject.java:2981)
at org.python.core.PyInstance.__findattr__(PyInstance.java:212)
at org.python.core.PyInstance.__findattr__(PyInstance.java:201)
at org.python.core.PyObject.__getattr__(PyObject.java:984)
at org.das2.jythoncompletion.JythonCompletionTask.queryMethods(JythonCompletionTask.java:417)
at org.das2.jythoncompletion.JythonCompletionTask.doQuery(JythonCompletionTask.java:186)
at test.endtoend.Test038.getCompletionsCount(Test038.java:136)
at test.endtoend.Test038.doTestsCountCompletions(Test038.java:174)
at test.endtoend.Test038.doTests(Test038.java:58)
at test.endtoend.Test038.testGetParams(Test038.java:276)
at test.endtoend.Test038.main(Test038.java:303)
Oct 01, 2026 1:21:52 PM org.das2.jythoncompletion.JythonCompletionTask queryMethods
SEVERE: null
Traceback (innermost last):
(no code object) at line 0
TypeError: write only attribute
at org.python.core.Py.TypeError(Py.java:157)
at org.python.core.PyBeanEvent._doget(PyBeanEvent.java:17)
at org.python.core.PyObject._doget(PyObject.java:1103)
at org.python.core.PyObject.__get__(PyObject.java:2981)
at org.python.core.PyInstance.__findattr__(PyInstance.java:212)
at org.python.core.PyInstance.__findattr__(PyInstance.java:201)
at org.python.core.PyObject.__getattr__(PyObject.java:984)
at org.das2.jythoncompletion.JythonCompletionTask.queryMethods(JythonCompletionTask.java:417)
at org.das2.jythoncompletion.JythonCompletionTask.doQuery(JythonCompletionTask.java:186)
at test.endtoend.Test038.getCompletionsCount(Test038.java:136)
at test.endtoend.Test038.doTestsCountCompletions(Test038.java:174)
at test.endtoend.Test038.doTests(Test038.java:58)
at test.endtoend.Test038.testGetParams(Test038.java:276)
at test.endtoend.Test038.main(Test038.java:303)
Oct 01, 2026 1:21:52 PM org.das2.jythoncompletion.JythonCompletionTask queryMethods
SEVERE: null
Traceback (innermost last):
(no code object) at line 0
TypeError: write only attribute
at org.python.core.Py.TypeError(Py.java:157)
at org.python.core.PyBeanEvent._doget(PyBeanEvent.java:17)
at org.python.core.PyObject._doget(PyObject.java:1103)
at org.python.core.PyObject.__get__(PyObject.java:2981)
at org.python.core.PyInstance.__findattr__(PyInstance.java:212)
at org.python.core.PyInstance.__findattr__(PyInstance.java:201)
at org.python.core.PyObject.__getattr__(PyObject.java:984)
at org.das2.jythoncompletion.JythonCompletionTask.queryMethods(JythonCompletionTask.java:417)
at org.das2.jythoncompletion.JythonCompletionTask.doQuery(JythonCompletionTask.java:186)
at test.endtoend.Test038.getCompletionsCount(Test038.java:136)
at test.endtoend.Test038.doTestsCountCompletions(Test038.java:174)
at test.endtoend.Test038.doTests(Test038.java:58)
at test.endtoend.Test038.testGetParams(Test038.java:276)
at test.endtoend.Test038.main(Test038.java:303)
Oct 01, 2026 1:21:52 PM org.das2.jythoncompletion.JythonCompletionTask queryMethods
SEVERE: null
Traceback (innermost last):
(no code object) at line 0
TypeError: write only attribute
at org.python.core.Py.TypeError(Py.java:157)
at org.python.core.PyBeanEvent._doget(PyBeanEvent.java:17)
at org.python.core.PyObject._doget(PyObject.java:1103)
at org.python.core.PyObject.__get__(PyObject.java:2981)
at org.python.core.PyInstance.__findattr__(PyInstance.java:212)
at org.python.core.PyInstance.__findattr__(PyInstance.java:201)
at org.python.core.PyObject.__getattr__(PyObject.java:984)
at org.das2.jythoncompletion.JythonCompletionTask.queryMethods(JythonCompletionTask.java:417)
at org.das2.jythoncompletion.JythonCompletionTask.doQuery(JythonCompletionTask.java:186)
at test.endtoend.Test038.getCompletionsCount(Test038.java:136)
at test.endtoend.Test038.doTestsCountCompletions(Test038.java:174)
at test.endtoend.Test038.doTests(Test038.java:58)
at test.endtoend.Test038.testGetParams(Test038.java:276)
at test.endtoend.Test038.main(Test038.java:303)
Oct 01, 2026 1:21:52 PM org.das2.jythoncompletion.JythonCompletionTask queryMethods
SEVERE: null
Traceback (innermost last):
(no code object) at line 0
TypeError: write only attribute
at org.python.core.Py.TypeError(Py.java:157)
at org.python.core.PyBeanEvent._doget(PyBeanEvent.java:17)
at org.python.core.PyObject._doget(PyObject.java:1103)
at org.python.core.PyObject.__get__(PyObject.java:2981)
at org.python.core.PyInstance.__findattr__(PyInstance.java:212)
at org.python.core.PyInstance.__findattr__(PyInstance.java:201)
at org.python.core.PyObject.__getattr__(PyObject.java:984)
at org.das2.jythoncompletion.JythonCompletionTask.queryMethods(JythonCompletionTask.java:417)
at org.das2.jythoncompletion.JythonCompletionTask.doQuery(JythonCompletionTask.java:186)
at test.endtoend.Test038.getCompletionsCount(Test038.java:136)
at test.endtoend.Test038.doTestsCountCompletions(Test038.java:174)
at test.endtoend.Test038.doTests(Test038.java:58)
at test.endtoend.Test038.testGetParams(Test038.java:276)
at test.endtoend.Test038.main(Test038.java:303)
Oct 01, 2026 1:21:52 PM org.das2.jythoncompletion.JythonCompletionTask queryMethods
SEVERE: null
Traceback (innermost last):
(no code object) at line 0
TypeError: write only attribute
at org.python.core.Py.TypeError(Py.java:157)
at org.python.core.PyBeanEvent._doget(PyBeanEvent.java:17)
at org.python.core.PyObject._doget(PyObject.java:1103)
at org.python.core.PyObject.__get__(PyObject.java:2981)
at org.python.core.PyInstance.__findattr__(PyInstance.java:212)
at org.python.core.PyInstance.__findattr__(PyInstance.java:201)
at org.python.core.PyObject.__getattr__(PyObject.java:984)
at org.das2.jythoncompletion.JythonCompletionTask.queryMethods(JythonCompletionTask.java:417)
at org.das2.jythoncompletion.JythonCompletionTask.doQuery(JythonCompletionTask.java:186)
at test.endtoend.Test038.getCompletionsCount(Test038.java:136)
at test.endtoend.Test038.doTestsCountCompletions(Test038.java:174)
at test.endtoend.Test038.doTests(Test038.java:58)
at test.endtoend.Test038.testGetParams(Test038.java:276)
at test.endtoend.Test038.main(Test038.java:303)
Oct 01, 2026 1:21:52 PM org.das2.jythoncompletion.JythonCompletionTask queryMethods
SEVERE: null
Traceback (innermost last):
(no code object) at line 0
java.awt.IllegalComponentStateException: component must be showing on the screen to determine its location
at java.awt.Component.getLocationOnScreen_NoTreeLock(Component.java:2062)
at java.awt.Component.getLocationOnScreen(Component.java:2036)
at sun.reflect.NativeMethodAccessorImpl.invoke0(Native Method)
at sun.reflect.NativeMethodAccessorImpl.invoke(NativeMethodAccessorImpl.java:62)
at sun.reflect.DelegatingMethodAccessorImpl.invoke(DelegatingMethodAccessorImpl.java:43)
at java.lang.reflect.Method.invoke(Method.java:498)
at org.python.core.PyBeanProperty._doget(PyBeanProperty.java:34)
at org.python.core.PyObject._doget(PyObject.java:1103)
at org.python.core.PyObject.__get__(PyObject.java:2981)
at org.python.core.PyInstance.__findattr__(PyInstance.java:212)
at org.python.core.PyInstance.__findattr__(PyInstance.java:201)
at org.python.core.PyObject.__getattr__(PyObject.java:984)
at org.das2.jythoncompletion.JythonCompletionTask.queryMethods(JythonCompletionTask.java:417)
at org.das2.jythoncompletion.JythonCompletionTask.doQuery(JythonCompletionTask.java:186)
at test.endtoend.Test038.getCompletionsCount(Test038.java:136)
at test.endtoend.Test038.doTestsCountCompletions(Test038.java:174)
at test.endtoend.Test038.doTests(Test038.java:58)
at test.endtoend.Test038.testGetParams(Test038.java:276)
at test.endtoend.Test038.main(Test038.java:303)
java.awt.IllegalComponentStateException: java.awt.IllegalComponentStateException: component must be showing on the screen to determine its location
at org.python.core.Py.JavaError(Py.java:368)
at org.python.core.Py.JavaError(Py.java:363)
at org.python.core.PyBeanProperty._doget(PyBeanProperty.java:37)
at org.python.core.PyObject._doget(PyObject.java:1103)
at org.python.core.PyObject.__get__(PyObject.java:2981)
at org.python.core.PyInstance.__findattr__(PyInstance.java:212)
at org.python.core.PyInstance.__findattr__(PyInstance.java:201)
at org.python.core.PyObject.__getattr__(PyObject.java:984)
at org.das2.jythoncompletion.JythonCompletionTask.queryMethods(JythonCompletionTask.java:417)
at org.das2.jythoncompletion.JythonCompletionTask.doQuery(JythonCompletionTask.java:186)
at test.endtoend.Test038.getCompletionsCount(Test038.java:136)
at test.endtoend.Test038.doTestsCountCompletions(Test038.java:174)
at test.endtoend.Test038.doTests(Test038.java:58)
at test.endtoend.Test038.testGetParams(Test038.java:276)
at test.endtoend.Test038.main(Test038.java:303)
Oct 01, 2026 1:21:52 PM org.das2.jythoncompletion.JythonCompletionTask queryMethods
SEVERE: null
Traceback (innermost last):
(no code object) at line 0
TypeError: write only attribute
at org.python.core.Py.TypeError(Py.java:157)
at org.python.core.PyBeanEvent._doget(PyBeanEvent.java:17)
at org.python.core.PyObject._doget(PyObject.java:1103)
at org.python.core.PyObject.__get__(PyObject.java:2981)
at org.python.core.PyInstance.__findattr__(PyInstance.java:212)
at org.python.core.PyInstance.__findattr__(PyInstance.java:201)
at org.python.core.PyObject.__getattr__(PyObject.java:984)
at org.das2.jythoncompletion.JythonCompletionTask.queryMethods(JythonCompletionTask.java:417)
at org.das2.jythoncompletion.JythonCompletionTask.doQuery(JythonCompletionTask.java:186)
at test.endtoend.Test038.getCompletionsCount(Test038.java:136)
at test.endtoend.Test038.doTestsCountCompletions(Test038.java:174)
at test.endtoend.Test038.doTests(Test038.java:58)
at test.endtoend.Test038.testGetParams(Test038.java:276)
at test.endtoend.Test038.main(Test038.java:303)
Oct 01, 2026 1:21:52 PM org.das2.jythoncompletion.JythonCompletionTask queryMethods
SEVERE: null
Traceback (innermost last):
(no code object) at line 0
TypeError: write only attribute
at org.python.core.Py.TypeError(Py.java:157)
at org.python.core.PyBeanEvent._doget(PyBeanEvent.java:17)
at org.python.core.PyObject._doget(PyObject.java:1103)
at org.python.core.PyObject.__get__(PyObject.java:2981)
at org.python.core.PyInstance.__findattr__(PyInstance.java:212)
at org.python.core.PyInstance.__findattr__(PyInstance.java:201)
at org.python.core.PyObject.__getattr__(PyObject.java:984)
at org.das2.jythoncompletion.JythonCompletionTask.queryMethods(JythonCompletionTask.java:417)
at org.das2.jythoncompletion.JythonCompletionTask.doQuery(JythonCompletionTask.java:186)
at test.endtoend.Test038.getCompletionsCount(Test038.java:136)
at test.endtoend.Test038.doTestsCountCompletions(Test038.java:174)
at test.endtoend.Test038.doTests(Test038.java:58)
at test.endtoend.Test038.testGetParams(Test038.java:276)
at test.endtoend.Test038.main(Test038.java:303)
Oct 01, 2026 1:21:52 PM org.das2.jythoncompletion.JythonCompletionTask queryMethods
SEVERE: null
Traceback (innermost last):
(no code object) at line 0
TypeError: write only attribute
at org.python.core.Py.TypeError(Py.java:157)
at org.python.core.PyBeanEvent._doget(PyBeanEvent.java:17)
at org.python.core.PyObject._doget(PyObject.java:1103)
at org.python.core.PyObject.__get__(PyObject.java:2981)
at org.python.core.PyInstance.__findattr__(PyInstance.java:212)
at org.python.core.PyInstance.__findattr__(PyInstance.java:201)
at org.python.core.PyObject.__getattr__(PyObject.java:984)
at org.das2.jythoncompletion.JythonCompletionTask.queryMethods(JythonCompletionTask.java:417)
at org.das2.jythoncompletion.JythonCompletionTask.doQuery(JythonCompletionTask.java:186)
at test.endtoend.Test038.getCompletionsCount(Test038.java:136)
at test.endtoend.Test038.doTestsCountCompletions(Test038.java:174)
at test.endtoend.Test038.doTests(Test038.java:58)
at test.endtoend.Test038.testGetParams(Test038.java:276)
at test.endtoend.Test038.main(Test038.java:303)
Oct 01, 2026 1:21:52 PM org.das2.jythoncompletion.JythonCompletionTask queryMethods
SEVERE: null
Traceback (innermost last):
(no code object) at line 0
TypeError: write only attribute
at org.python.core.Py.TypeError(Py.java:157)
at org.python.core.PyBeanEvent._doget(PyBeanEvent.java:17)
at org.python.core.PyObject._doget(PyObject.java:1103)
at org.python.core.PyObject.__get__(PyObject.java:2981)
at org.python.core.PyInstance.__findattr__(PyInstance.java:212)
at org.python.core.PyInstance.__findattr__(PyInstance.java:201)
at org.python.core.PyObject.__getattr__(PyObject.java:984)
at org.das2.jythoncompletion.JythonCompletionTask.queryMethods(JythonCompletionTask.java:417)
at org.das2.jythoncompletion.JythonCompletionTask.doQuery(JythonCompletionTask.java:186)
at test.endtoend.Test038.getCompletionsCount(Test038.java:136)
at test.endtoend.Test038.doTestsCountCompletions(Test038.java:174)
at test.endtoend.Test038.doTests(Test038.java:58)
at test.endtoend.Test038.testGetParams(Test038.java:276)
at test.endtoend.Test038.main(Test038.java:303)
Oct 01, 2026 1:21:52 PM org.das2.jythoncompletion.JythonCompletionTask queryMethods
SEVERE: null
Traceback (innermost last):
(no code object) at line 0
TypeError: write only attribute
at org.python.core.Py.TypeError(Py.java:157)
at org.python.core.PyBeanEvent._doget(PyBeanEvent.java:17)
at org.python.core.PyObject._doget(PyObject.java:1103)
at org.python.core.PyObject.__get__(PyObject.java:2981)
at org.python.core.PyInstance.__findattr__(PyInstance.java:212)
at org.python.core.PyInstance.__findattr__(PyInstance.java:201)
at org.python.core.PyObject.__getattr__(PyObject.java:984)
at org.das2.jythoncompletion.JythonCompletionTask.queryMethods(JythonCompletionTask.java:417)
at org.das2.jythoncompletion.JythonCompletionTask.doQuery(JythonCompletionTask.java:186)
at test.endtoend.Test038.getCompletionsCount(Test038.java:136)
at test.endtoend.Test038.doTestsCountCompletions(Test038.java:174)
at test.endtoend.Test038.doTests(Test038.java:58)
at test.endtoend.Test038.testGetParams(Test038.java:276)
at test.endtoend.Test038.main(Test038.java:303)
overwriting /var/local/jenkins/workspace/autoplot-test038/test038.windlistener.jy.cdf
overwriting /var/local/jenkins/workspace/autoplot-test038/test038.windlistener.jy.cdf
overwriting /var/local/jenkins/workspace/autoplot-test038/test038.windlistener.jy.cdf
== test 009: /home/jbf/ct/hudson/script/test038/jydsCommentBug.jyds ==
read params in 25 millis: /home/jbf/ct/hudson/script/test038/jydsCommentBug.jyds
== test 009: /home/jbf/ct/hudson/script/test038/jydsCommentBug.jyds ==
read params in 14 millis: /home/jbf/ct/hudson/script/test038/jydsCommentBug.jyds
== test 009: /home/jbf/ct/hudson/script/test038/jydsCommentBug.jyds ==
overwriting /var/local/jenkins/workspace/autoplot-test038/test038.jydsCommentBug.jyds.cdf
overwriting /var/local/jenkins/workspace/autoplot-test038/test038.jydsCommentBug.jyds.cdf
overwriting /var/local/jenkins/workspace/autoplot-test038/test038.jydsCommentBug.jyds.cdf
== test 010: /home/jbf/ct/hudson/script/test038/addPointDigitizer.jy ==
mode=LFRH
svybst=surveyall
reduce=1s
newVersion=1
read params in 11 millis: /home/jbf/ct/hudson/script/test038/addPointDigitizer.jy
== test 010: /home/jbf/ct/hudson/script/test038/addPointDigitizer.jy ==
mode=LFRH
svybst=surveyall
reduce=1s
newVersion=1
read params in 9 millis: /home/jbf/ct/hudson/script/test038/addPointDigitizer.jy
== test 010: /home/jbf/ct/hudson/script/test038/addPointDigitizer.jy ==
overwriting /var/local/jenkins/workspace/autoplot-test038/test038.addPointDigitizer.jy.cdf
overwriting /var/local/jenkins/workspace/autoplot-test038/test038.addPointDigitizer.jy.cdf
overwriting /var/local/jenkins/workspace/autoplot-test038/test038.addPointDigitizer.jy.cdf
== test 002: /home/jbf/ct/hudson/script/test038/demoParms1.jy ==
src=rbsp
pub=ECT
pub2=ECT
read params in 11 millis: /home/jbf/ct/hudson/script/test038/demoParms1.jy
== test 002: /home/jbf/ct/hudson/script/test038/demoParms1.jy ==
src=rbsp
pub=ECT
pub2=ECT
read params in 9 millis: /home/jbf/ct/hudson/script/test038/demoParms1.jy
== test 002: /home/jbf/ct/hudson/script/test038/demoParms1.jy ==
overwriting /var/local/jenkins/workspace/autoplot-test038/test038.demoParms1.jy.cdf
overwriting /var/local/jenkins/workspace/autoplot-test038/test038.demoParms1.jy.cdf
overwriting /var/local/jenkins/workspace/autoplot-test038/test038.demoParms1.jy.cdf
== test 008: /home/jbf/ct/hudson/script/test038/jedi_l3_valid_tofxe_events.jyds ==
timerange=2016-130
fan=090
sp=I
telescope=2
timeBinWidth=0s
read params in 20 millis: /home/jbf/ct/hudson/script/test038/jedi_l3_valid_tofxe_events.jyds
== test 008: /home/jbf/ct/hudson/script/test038/jedi_l3_valid_tofxe_events.jyds ==
timerange=2016-130
fan=090
sp=I
telescope=2
timeBinWidth=0s
read params in 21 millis: /home/jbf/ct/hudson/script/test038/jedi_l3_valid_tofxe_events.jyds
== test 008: /home/jbf/ct/hudson/script/test038/jedi_l3_valid_tofxe_events.jyds ==
Oct 01, 2026 1:22:08 PM org.das2.jythoncompletion.DataSetUrlCompletionTask query
SEVERE: null
java.lang.NullPointerException
at java.lang.String.startsWith(String.java:1405)
at java.lang.String.startsWith(String.java:1434)
at org.das2.jythoncompletion.DataSetUrlCompletionItem.<init>(DataSetUrlCompletionItem.java:28)
at org.das2.jythoncompletion.DataSetUrlCompletionTask.query(DataSetUrlCompletionTask.java:142)
at org.das2.jythoncompletion.JythonCompletionTask.queryStringLiteralArgument(JythonCompletionTask.java:1129)
at org.das2.jythoncompletion.JythonCompletionTask.doQuery(JythonCompletionTask.java:189)
at test.endtoend.Test038.getCompletionsCount(Test038.java:136)
at test.endtoend.Test038.doTestsCountCompletions(Test038.java:174)
at test.endtoend.Test038.doTests(Test038.java:58)
at test.endtoend.Test038.testGetParams(Test038.java:280)
at test.endtoend.Test038.main(Test038.java:303)
Oct 01, 2026 1:22:08 PM org.das2.util.filesystem.HttpFileSystem createHttpFileSystem
WARNING: filesystem is offline: http://www-pw.physics.uiowa.edu/juno/mwg/
Oct 01, 2026 1:22:08 PM org.das2.util.filesystem.HttpFileSystem createHttpFileSystem
WARNING: filesystem is offline: http://www-pw.physics.uiowa.edu/juno/mwg/mirror/jed_apl_unpack/data/l3/
Oct 01, 2026 1:22:08 PM org.das2.jythoncompletion.DataSetUrlCompletionTask query
SEVERE: null
java.lang.NullPointerException
at java.util.regex.Matcher.getTextLength(Matcher.java:1283)
at java.util.regex.Matcher.reset(Matcher.java:309)
at java.util.regex.Matcher.<init>(Matcher.java:229)
at java.util.regex.Pattern.matcher(Pattern.java:1093)
at org.das2.fsm.FileStorageModel.getDatumRangeFor(FileStorageModel.java:394)
at org.das2.fsm.FileStorageModel.getRangeFor(FileStorageModel.java:821)
at org.autoplot.datasource.DataSetURI.getFileSystemCompletions(DataSetURI.java:1991)
at org.autoplot.datasource.DataSetURI.getFileSystemCompletions(DataSetURI.java:1825)
at org.autoplot.datasource.DataSetURI.getCompletions(DataSetURI.java:1669)
at org.das2.jythoncompletion.DataSetUrlCompletionTask.query(DataSetUrlCompletionTask.java:139)
at org.das2.jythoncompletion.JythonCompletionTask.queryStringLiteralArgument(JythonCompletionTask.java:1129)
at org.das2.jythoncompletion.JythonCompletionTask.doQuery(JythonCompletionTask.java:189)
at test.endtoend.Test038.getCompletionsCount(Test038.java:136)
at test.endtoend.Test038.doTestsCountCompletions(Test038.java:174)
at test.endtoend.Test038.doTests(Test038.java:58)
at test.endtoend.Test038.testGetParams(Test038.java:280)
at test.endtoend.Test038.main(Test038.java:303)
overwriting /var/local/jenkins/workspace/autoplot-test038/test038.jedi_l3_valid_tofxe_events.jyds.cdf
overwriting /var/local/jenkins/workspace/autoplot-test038/test038.jedi_l3_valid_tofxe_events.jyds.cdf
overwriting /var/local/jenkins/workspace/autoplot-test038/test038.jedi_l3_valid_tofxe_events.jyds.cdf
== test 000: /home/jbf/ct/hudson/script/test038/trivial.jy ==
src=rbsp
read params in 8 millis: /home/jbf/ct/hudson/script/test038/trivial.jy
== test 000: /home/jbf/ct/hudson/script/test038/trivial.jy ==
src=rbsp
read params in 6 millis: /home/jbf/ct/hudson/script/test038/trivial.jy
== test 000: /home/jbf/ct/hudson/script/test038/trivial.jy ==
overwriting /var/local/jenkins/workspace/autoplot-test038/test038.trivial.jy.cdf
overwriting /var/local/jenkins/workspace/autoplot-test038/test038.trivial.jy.cdf
overwriting /var/local/jenkins/workspace/autoplot-test038/test038.trivial.jy.cdf
== test 001: /home/jbf/ct/hudson/script/test038/demoParms0.jy ==
src=rbsp
pub=ECT
read params in 16 millis: /home/jbf/ct/hudson/script/test038/demoParms0.jy
== test 001: /home/jbf/ct/hudson/script/test038/demoParms0.jy ==
src=rbsp
pub=ECT
read params in 12 millis: /home/jbf/ct/hudson/script/test038/demoParms0.jy
== test 001: /home/jbf/ct/hudson/script/test038/demoParms0.jy ==
Oct 01, 2026 1:22:16 PM org.das2.jythoncompletion.DataSetUrlCompletionTask query
SEVERE: null
java.lang.NullPointerException
at java.lang.String.startsWith(String.java:1405)
at java.lang.String.startsWith(String.java:1434)
at org.das2.jythoncompletion.DataSetUrlCompletionItem.<init>(DataSetUrlCompletionItem.java:28)
at org.das2.jythoncompletion.DataSetUrlCompletionTask.query(DataSetUrlCompletionTask.java:142)
at org.das2.jythoncompletion.JythonCompletionTask.queryStringLiteralArgument(JythonCompletionTask.java:1109)
at org.das2.jythoncompletion.JythonCompletionTask.doQuery(JythonCompletionTask.java:189)
at test.endtoend.Test038.getCompletionsCount(Test038.java:136)
at test.endtoend.Test038.doTestsCountCompletions(Test038.java:174)
at test.endtoend.Test038.doTests(Test038.java:58)
at test.endtoend.Test038.testGetParams(Test038.java:282)
at test.endtoend.Test038.main(Test038.java:303)
Oct 01, 2026 1:22:16 PM org.das2.jythoncompletion.DataSetUrlCompletionTask query
SEVERE: null
java.lang.NullPointerException
at java.lang.String.startsWith(String.java:1405)
at java.lang.String.startsWith(String.java:1434)
at org.das2.jythoncompletion.DataSetUrlCompletionItem.<init>(DataSetUrlCompletionItem.java:28)
at org.das2.jythoncompletion.DataSetUrlCompletionTask.query(DataSetUrlCompletionTask.java:142)
at org.das2.jythoncompletion.JythonCompletionTask.queryStringLiteralArgument(JythonCompletionTask.java:1109)
at org.das2.jythoncompletion.JythonCompletionTask.doQuery(JythonCompletionTask.java:189)
at test.endtoend.Test038.getCompletionsCount(Test038.java:136)
at test.endtoend.Test038.doTestsCountCompletions(Test038.java:174)
at test.endtoend.Test038.doTests(Test038.java:58)
at test.endtoend.Test038.testGetParams(Test038.java:282)
at test.endtoend.Test038.main(Test038.java:303)
Oct 01, 2026 1:22:16 PM org.das2.jythoncompletion.DataSetUrlCompletionTask query
SEVERE: null
java.lang.NullPointerException
at java.lang.String.startsWith(String.java:1405)
at java.lang.String.startsWith(String.java:1434)
at org.das2.jythoncompletion.DataSetUrlCompletionItem.<init>(DataSetUrlCompletionItem.java:28)
at org.das2.jythoncompletion.DataSetUrlCompletionTask.query(DataSetUrlCompletionTask.java:142)
at org.das2.jythoncompletion.JythonCompletionTask.queryStringLiteralArgument(JythonCompletionTask.java:1109)
at org.das2.jythoncompletion.JythonCompletionTask.doQuery(JythonCompletionTask.java:189)
at test.endtoend.Test038.getCompletionsCount(Test038.java:136)
at test.endtoend.Test038.doTestsCountCompletions(Test038.java:174)
at test.endtoend.Test038.doTests(Test038.java:58)
at test.endtoend.Test038.testGetParams(Test038.java:282)
at test.endtoend.Test038.main(Test038.java:303)
Oct 01, 2026 1:22:16 PM org.das2.jythoncompletion.DataSetUrlCompletionTask query
SEVERE: null
java.lang.NullPointerException
at java.lang.String.startsWith(String.java:1405)
at java.lang.String.startsWith(String.java:1434)
at org.das2.jythoncompletion.DataSetUrlCompletionItem.<init>(DataSetUrlCompletionItem.java:28)
at org.das2.jythoncompletion.DataSetUrlCompletionTask.query(DataSetUrlCompletionTask.java:142)
at org.das2.jythoncompletion.JythonCompletionTask.queryStringLiteralArgument(JythonCompletionTask.java:1109)
at org.das2.jythoncompletion.JythonCompletionTask.doQuery(JythonCompletionTask.java:189)
at test.endtoend.Test038.getCompletionsCount(Test038.java:136)
at test.endtoend.Test038.doTestsCountCompletions(Test038.java:174)
at test.endtoend.Test038.doTests(Test038.java:58)
at test.endtoend.Test038.testGetParams(Test038.java:282)
at test.endtoend.Test038.main(Test038.java:303)
Oct 01, 2026 1:22:16 PM org.das2.jythoncompletion.DataSetUrlCompletionTask query
SEVERE: null
java.lang.NullPointerException
Oct 01, 2026 1:22:16 PM org.das2.jythoncompletion.DataSetUrlCompletionTask query
SEVERE: null
java.lang.NullPointerException
Oct 01, 2026 1:22:16 PM org.das2.jythoncompletion.DataSetUrlCompletionTask query
SEVERE: null
java.lang.NullPointerException
Oct 01, 2026 1:22:16 PM org.das2.jythoncompletion.DataSetUrlCompletionTask query
SEVERE: null
java.lang.NullPointerException
Oct 01, 2026 1:22:16 PM org.das2.jythoncompletion.DataSetUrlCompletionTask query
SEVERE: null
java.lang.NullPointerException
overwriting /var/local/jenkins/workspace/autoplot-test038/test038.demoParms0.jy.cdf
overwriting /var/local/jenkins/workspace/autoplot-test038/test038.demoParms0.jy.cdf
overwriting /var/local/jenkins/workspace/autoplot-test038/test038.demoParms0.jy.cdf
== test 002: /home/jbf/ct/hudson/script/test038/demoParms1.jy ==
src=rbsp
pub=ECT
pub2=ECT
read params in 17 millis: /home/jbf/ct/hudson/script/test038/demoParms1.jy
== test 002: /home/jbf/ct/hudson/script/test038/demoParms1.jy ==
src=rbsp
pub=ECT
pub2=ECT
read params in 14 millis: /home/jbf/ct/hudson/script/test038/demoParms1.jy
== test 002: /home/jbf/ct/hudson/script/test038/demoParms1.jy ==
overwriting /var/local/jenkins/workspace/autoplot-test038/test038.demoParms1.jy.cdf
overwriting /var/local/jenkins/workspace/autoplot-test038/test038.demoParms1.jy.cdf
overwriting /var/local/jenkins/workspace/autoplot-test038/test038.demoParms1.jy.cdf
== test 003: /home/jbf/ct/hudson/script/test038/demoParms.jy ==
src=rbsp
pub=ECT
sc=rbspa
R=F
L*=F
MLT=F
MLAT=F
ILT=F
read params in 19 millis: /home/jbf/ct/hudson/script/test038/demoParms.jy
== test 003: /home/jbf/ct/hudson/script/test038/demoParms.jy ==
src=rbsp
pub=ECT
sc=rbspa
R=F
L*=F
MLT=F
MLAT=F
ILT=F
read params in 15 millis: /home/jbf/ct/hudson/script/test038/demoParms.jy
== test 003: /home/jbf/ct/hudson/script/test038/demoParms.jy ==
Oct 01, 2026 1:22:23 PM org.das2.util.filesystem.HttpFileSystem createHttpFileSystem
WARNING: filesystem is offline: http://www.rbsp-ect.lanl.gov/data_pub/
Oct 01, 2026 1:22:23 PM org.das2.util.filesystem.HttpFileSystem createHttpFileSystem
WARNING: filesystem is offline: http://www.rbsp-ect.lanl.gov/data_pub/autoplot/
Oct 01, 2026 1:22:23 PM org.das2.util.filesystem.HttpFileSystem createHttpFileSystem
WARNING: filesystem is offline: http://www.rbsp-ect.lanl.gov/data_pub/autoplot/scripts/
Oct 01, 2026 1:22:23 PM org.das2.util.filesystem.HttpFileSystem createHttpFileSystem
WARNING: filesystem is offline: http://emfisis.physics.uiowa.edu/
Oct 01, 2026 1:22:23 PM org.das2.jythoncompletion.DataSetUrlCompletionTask query
SEVERE: null
java.lang.NullPointerException
Oct 01, 2026 1:22:23 PM org.das2.util.filesystem.HttpFileSystem createHttpFileSystem
WARNING: filesystem is offline: http://www-pw.physics.uiowa.edu/
overwriting /var/local/jenkins/workspace/autoplot-test038/test038.demoParms.jy.cdf
overwriting /var/local/jenkins/workspace/autoplot-test038/test038.demoParms.jy.cdf
overwriting /var/local/jenkins/workspace/autoplot-test038/test038.demoParms.jy.cdf
== test 004: /home/jbf/ct/hudson/script/test038/rbsp/emfisis/background_removal_wfr.jyds ==
Traceback (innermost last):
(no code object) at line 0
File "<string>", line 9
resourcefile_on = (((((('http://emfisis.physics.uiowa.edu/events/rbsp-' + lowsc) + '/backgrounds/peak_wfr_') + resourcechannel[<UNSUPPORTED:Slice>].lower()) + '_') + resourcesc) + '_attenuator_on.qds')
^
SyntaxError: invalid syntax
*** failed within 19 millis: /home/jbf/ct/hudson/script/test038/rbsp/emfisis/background_removal_wfr.jyds
== test 004: /home/jbf/ct/hudson/script/test038/rbsp/emfisis/background_removal_wfr.jyds ==
Traceback (innermost last):
(no code object) at line 0
File "<string>", line 9
resourcefile_on = (((((('http://emfisis.physics.uiowa.edu/events/rbsp-' + lowsc) + '/backgrounds/peak_wfr_') + resourcechannel[<UNSUPPORTED:Slice>].lower()) + '_') + resourcesc) + '_attenuator_on.qds')
^
SyntaxError: invalid syntax
*** failed within 17 millis: /home/jbf/ct/hudson/script/test038/rbsp/emfisis/background_removal_wfr.jyds
== test 004: /home/jbf/ct/hudson/script/test038/rbsp/emfisis/background_removal_wfr.jyds ==
Oct 01, 2026 1:22:26 PM org.das2.jythoncompletion.DataSetUrlCompletionTask query
SEVERE: local root does not exist: /backgrounds
java.io.FileNotFoundException: local root does not exist: /backgrounds
at org.das2.util.filesystem.LocalFileSystem.<init>(LocalFileSystem.java:78)
at org.das2.util.filesystem.LocalFileSystemFactory.createFileSystem(LocalFileSystemFactory.java:41)
at org.das2.util.filesystem.FileSystem.create(FileSystem.java:495)
at org.das2.util.filesystem.FileSystem.create(FileSystem.java:138)
at org.autoplot.datasource.DataSetURI.getFileSystemCompletions(DataSetURI.java:2017)
at org.autoplot.datasource.DataSetURI.getFileSystemCompletions(DataSetURI.java:1825)
at org.autoplot.datasource.DataSetURI.getCompletions(DataSetURI.java:1669)
at org.das2.jythoncompletion.DataSetUrlCompletionTask.query(DataSetUrlCompletionTask.java:139)
at org.das2.jythoncompletion.JythonCompletionTask.queryStringLiteralArgument(JythonCompletionTask.java:1129)
at org.das2.jythoncompletion.JythonCompletionTask.doQuery(JythonCompletionTask.java:189)
at test.endtoend.Test038.getCompletionsCount(Test038.java:136)
at test.endtoend.Test038.doTestsCountCompletions(Test038.java:174)
at test.endtoend.Test038.doTests(Test038.java:58)
at test.endtoend.Test038.testGetParams(Test038.java:285)
at test.endtoend.Test038.main(Test038.java:303)
overwriting /var/local/jenkins/workspace/autoplot-test038/test038.background_removal_wfr.jyds.cdf
overwriting /var/local/jenkins/workspace/autoplot-test038/test038.background_removal_wfr.jyds.cdf
overwriting /var/local/jenkins/workspace/autoplot-test038/test038.background_removal_wfr.jyds.cdf
== test 005: /home/jbf/ct/hudson/script/test038/demoParms2.jy ==
pub2=ECT
read params in 13 millis: /home/jbf/ct/hudson/script/test038/demoParms2.jy
== test 005: /home/jbf/ct/hudson/script/test038/demoParms2.jy ==
pub2=ECT
read params in 7 millis: /home/jbf/ct/hudson/script/test038/demoParms2.jy
== test 005: /home/jbf/ct/hudson/script/test038/demoParms2.jy ==
overwriting /var/local/jenkins/workspace/autoplot-test038/test038.demoParms2.jy.cdf
overwriting /var/local/jenkins/workspace/autoplot-test038/test038.demoParms2.jy.cdf
overwriting /var/local/jenkins/workspace/autoplot-test038/test038.demoParms2.jy.cdf
== test 006: /home/jbf/ct/hudson/script/test038/fce_A.jyds ==
timerange=2012-09-26
subsamp=0
typ=fce
read params in 17 millis: /home/jbf/ct/hudson/script/test038/fce_A.jyds
== test 006: /home/jbf/ct/hudson/script/test038/fce_A.jyds ==
timerange=2012-09-26
subsamp=0
typ=fce
read params in 16 millis: /home/jbf/ct/hudson/script/test038/fce_A.jyds
== test 006: /home/jbf/ct/hudson/script/test038/fce_A.jyds ==
Oct 01, 2026 1:22:32 PM org.das2.util.filesystem.HttpFileSystem createHttpFileSystem
WARNING: filesystem is offline: http://emfisis.physics.uiowa.edu/Flight/RBSP-A/
Oct 01, 2026 1:22:32 PM org.autoplot.datasource.DataSetURI getFileSystemCompletions
WARNING: parse exception: {0}
java.text.ParseException: failed attempt to parse int in "%s"
at org.das2.datum.DatumRangeUtil.parseInt(DatumRangeUtil.java:159)
at org.das2.datum.DatumRangeUtil.access$100(DatumRangeUtil.java:15)
at org.das2.datum.DatumRangeUtil$TimeRangeParser.parse(DatumRangeUtil.java:1224)
at org.das2.datum.DatumRangeUtil.parseTimeRange(DatumRangeUtil.java:1607)
at org.autoplot.datasource.DataSetURI.getFileSystemCompletions(DataSetURI.java:1971)
at org.autoplot.datasource.DataSetURI.getFileSystemCompletions(DataSetURI.java:1825)
at org.autoplot.datasource.DataSetURI.getCompletions(DataSetURI.java:1669)
at org.das2.jythoncompletion.DataSetUrlCompletionTask.query(DataSetUrlCompletionTask.java:139)
at org.das2.jythoncompletion.JythonCompletionTask.queryStringLiteralArgument(JythonCompletionTask.java:1109)
at org.das2.jythoncompletion.JythonCompletionTask.doQuery(JythonCompletionTask.java:189)
at test.endtoend.Test038.getCompletionsCount(Test038.java:136)
at test.endtoend.Test038.doTestsCountCompletions(Test038.java:174)
at test.endtoend.Test038.doTests(Test038.java:58)
at test.endtoend.Test038.testGetParams(Test038.java:287)
at test.endtoend.Test038.main(Test038.java:303)
Oct 01, 2026 1:22:32 PM org.das2.util.filesystem.HttpFileSystem createHttpFileSystem
WARNING: filesystem is offline: http://emfisis.physics.uiowa.edu/Flight/RBSP-A/Quick-Look/
Oct 01, 2026 1:22:32 PM org.das2.jythoncompletion.DataSetUrlCompletionTask query
SEVERE: null
java.lang.NullPointerException
at java.util.regex.Matcher.getTextLength(Matcher.java:1283)
at java.util.regex.Matcher.reset(Matcher.java:309)
at java.util.regex.Matcher.<init>(Matcher.java:229)
at java.util.regex.Pattern.matcher(Pattern.java:1093)
at org.das2.fsm.FileStorageModel.getDatumRangeFor(FileStorageModel.java:394)
at org.das2.fsm.FileStorageModel.getRangeFor(FileStorageModel.java:821)
at org.autoplot.datasource.DataSetURI.getFileSystemCompletions(DataSetURI.java:1991)
at org.autoplot.datasource.DataSetURI.getFileSystemCompletions(DataSetURI.java:1825)
at org.autoplot.datasource.DataSetURI.getCompletions(DataSetURI.java:1669)
at org.das2.jythoncompletion.DataSetUrlCompletionTask.query(DataSetUrlCompletionTask.java:139)
at org.das2.jythoncompletion.JythonCompletionTask.queryStringLiteralArgument(JythonCompletionTask.java:1109)
at org.das2.jythoncompletion.JythonCompletionTask.doQuery(JythonCompletionTask.java:189)
at test.endtoend.Test038.getCompletionsCount(Test038.java:136)
at test.endtoend.Test038.doTestsCountCompletions(Test038.java:174)
at test.endtoend.Test038.doTests(Test038.java:58)
at test.endtoend.Test038.testGetParams(Test038.java:287)
at test.endtoend.Test038.main(Test038.java:303)
Oct 01, 2026 1:22:32 PM org.autoplot.datasource.DataSetURI getFileSystemCompletions
WARNING: parse exception: {0}
java.text.ParseException: failed attempt to parse int in "%s"
at org.das2.datum.DatumRangeUtil.parseInt(DatumRangeUtil.java:159)
at org.das2.datum.DatumRangeUtil.access$100(DatumRangeUtil.java:15)
at org.das2.datum.DatumRangeUtil$TimeRangeParser.parse(DatumRangeUtil.java:1224)
at org.das2.datum.DatumRangeUtil.parseTimeRange(DatumRangeUtil.java:1607)
at org.autoplot.datasource.DataSetURI.getFileSystemCompletions(DataSetURI.java:1971)
at org.autoplot.datasource.DataSetURI.getFileSystemCompletions(DataSetURI.java:1825)
at org.autoplot.datasource.DataSetURI.getCompletions(DataSetURI.java:1669)
at org.das2.jythoncompletion.DataSetUrlCompletionTask.query(DataSetUrlCompletionTask.java:139)
at org.das2.jythoncompletion.JythonCompletionTask.queryStringLiteralArgument(JythonCompletionTask.java:1109)
at org.das2.jythoncompletion.JythonCompletionTask.doQuery(JythonCompletionTask.java:189)
at test.endtoend.Test038.getCompletionsCount(Test038.java:136)
at test.endtoend.Test038.doTestsCountCompletions(Test038.java:174)
at test.endtoend.Test038.doTests(Test038.java:58)
at test.endtoend.Test038.testGetParams(Test038.java:287)
at test.endtoend.Test038.main(Test038.java:303)
Oct 01, 2026 1:22:32 PM org.das2.jythoncompletion.DataSetUrlCompletionTask query
SEVERE: null
java.lang.NullPointerException
at java.util.regex.Matcher.getTextLength(Matcher.java:1283)
at java.util.regex.Matcher.reset(Matcher.java:309)
at java.util.regex.Matcher.<init>(Matcher.java:229)
at java.util.regex.Pattern.matcher(Pattern.java:1093)
at org.das2.fsm.FileStorageModel.getDatumRangeFor(FileStorageModel.java:394)
at org.das2.fsm.FileStorageModel.getRangeFor(FileStorageModel.java:821)
at org.autoplot.datasource.DataSetURI.getFileSystemCompletions(DataSetURI.java:1991)
at org.autoplot.datasource.DataSetURI.getFileSystemCompletions(DataSetURI.java:1825)
at org.autoplot.datasource.DataSetURI.getCompletions(DataSetURI.java:1669)
at org.das2.jythoncompletion.DataSetUrlCompletionTask.query(DataSetUrlCompletionTask.java:139)
at org.das2.jythoncompletion.JythonCompletionTask.queryStringLiteralArgument(JythonCompletionTask.java:1109)
at org.das2.jythoncompletion.JythonCompletionTask.doQuery(JythonCompletionTask.java:189)
at test.endtoend.Test038.getCompletionsCount(Test038.java:136)
at test.endtoend.Test038.doTestsCountCompletions(Test038.java:174)
at test.endtoend.Test038.doTests(Test038.java:58)
at test.endtoend.Test038.testGetParams(Test038.java:287)
at test.endtoend.Test038.main(Test038.java:303)
Oct 01, 2026 1:22:32 PM org.autoplot.datasource.DataSetURI getFileSystemCompletions
WARNING: parse exception: {0}
java.text.ParseException: failed attempt to parse int in "%s"
at org.das2.datum.DatumRangeUtil.parseInt(DatumRangeUtil.java:159)
at org.das2.datum.DatumRangeUtil.access$100(DatumRangeUtil.java:15)
at org.das2.datum.DatumRangeUtil$TimeRangeParser.parse(DatumRangeUtil.java:1224)
at org.das2.datum.DatumRangeUtil.parseTimeRange(DatumRangeUtil.java:1607)
at org.autoplot.datasource.DataSetURI.getFileSystemCompletions(DataSetURI.java:1971)
at org.autoplot.datasource.DataSetURI.getFileSystemCompletions(DataSetURI.java:1825)
at org.autoplot.datasource.DataSetURI.getCompletions(DataSetURI.java:1669)
at org.das2.jythoncompletion.DataSetUrlCompletionTask.query(DataSetUrlCompletionTask.java:139)
at org.das2.jythoncompletion.JythonCompletionTask.queryStringLiteralArgument(JythonCompletionTask.java:1109)
at org.das2.jythoncompletion.JythonCompletionTask.doQuery(JythonCompletionTask.java:189)
at test.endtoend.Test038.getCompletionsCount(Test038.java:136)
at test.endtoend.Test038.doTestsCountCompletions(Test038.java:174)
at test.endtoend.Test038.doTests(Test038.java:58)
at test.endtoend.Test038.testGetParams(Test038.java:287)
at test.endtoend.Test038.main(Test038.java:303)
Oct 01, 2026 1:22:32 PM org.das2.jythoncompletion.DataSetUrlCompletionTask query
SEVERE: null
java.lang.NullPointerException
at java.util.regex.Matcher.getTextLength(Matcher.java:1283)
at java.util.regex.Matcher.reset(Matcher.java:309)
at java.util.regex.Matcher.<init>(Matcher.java:229)
at java.util.regex.Pattern.matcher(Pattern.java:1093)
at org.das2.fsm.FileStorageModel.getDatumRangeFor(FileStorageModel.java:394)
at org.das2.fsm.FileStorageModel.getRangeFor(FileStorageModel.java:821)
at org.autoplot.datasource.DataSetURI.getFileSystemCompletions(DataSetURI.java:1991)
at org.autoplot.datasource.DataSetURI.getFileSystemCompletions(DataSetURI.java:1825)
at org.autoplot.datasource.DataSetURI.getCompletions(DataSetURI.java:1669)
at org.das2.jythoncompletion.DataSetUrlCompletionTask.query(DataSetUrlCompletionTask.java:139)
at org.das2.jythoncompletion.JythonCompletionTask.queryStringLiteralArgument(JythonCompletionTask.java:1109)
at org.das2.jythoncompletion.JythonCompletionTask.doQuery(JythonCompletionTask.java:189)
at test.endtoend.Test038.getCompletionsCount(Test038.java:136)
at test.endtoend.Test038.doTestsCountCompletions(Test038.java:174)
at test.endtoend.Test038.doTests(Test038.java:58)
at test.endtoend.Test038.testGetParams(Test038.java:287)
at test.endtoend.Test038.main(Test038.java:303)
Oct 01, 2026 1:22:32 PM org.autoplot.datasource.DataSetURI getFileSystemCompletions
WARNING: parse exception: {0}
java.text.ParseException: failed attempt to parse int in "%s"
at org.das2.datum.DatumRangeUtil.parseInt(DatumRangeUtil.java:159)
at org.das2.datum.DatumRangeUtil.access$100(DatumRangeUtil.java:15)
at org.das2.datum.DatumRangeUtil$TimeRangeParser.parse(DatumRangeUtil.java:1224)
at org.das2.datum.DatumRangeUtil.parseTimeRange(DatumRangeUtil.java:1607)
at org.autoplot.datasource.DataSetURI.getFileSystemCompletions(DataSetURI.java:1971)
at org.autoplot.datasource.DataSetURI.getFileSystemCompletions(DataSetURI.java:1825)
at org.autoplot.datasource.DataSetURI.getCompletions(DataSetURI.java:1669)
at org.das2.jythoncompletion.DataSetUrlCompletionTask.query(DataSetUrlCompletionTask.java:139)
at org.das2.jythoncompletion.JythonCompletionTask.queryStringLiteralArgument(JythonCompletionTask.java:1109)
at org.das2.jythoncompletion.JythonCompletionTask.doQuery(JythonCompletionTask.java:189)
at test.endtoend.Test038.getCompletionsCount(Test038.java:136)
at test.endtoend.Test038.doTestsCountCompletions(Test038.java:174)
at test.endtoend.Test038.doTests(Test038.java:58)
at test.endtoend.Test038.testGetParams(Test038.java:287)
at test.endtoend.Test038.main(Test038.java:303)
Oct 01, 2026 1:22:32 PM org.das2.jythoncompletion.DataSetUrlCompletionTask query
SEVERE: null
java.lang.NullPointerException
at java.util.regex.Matcher.getTextLength(Matcher.java:1283)
at java.util.regex.Matcher.reset(Matcher.java:309)
at java.util.regex.Matcher.<init>(Matcher.java:229)
at java.util.regex.Pattern.matcher(Pattern.java:1093)
at org.das2.fsm.FileStorageModel.getDatumRangeFor(FileStorageModel.java:394)
at org.das2.fsm.FileStorageModel.getRangeFor(FileStorageModel.java:821)
at org.autoplot.datasource.DataSetURI.getFileSystemCompletions(DataSetURI.java:1991)
at org.autoplot.datasource.DataSetURI.getFileSystemCompletions(DataSetURI.java:1825)
at org.autoplot.datasource.DataSetURI.getCompletions(DataSetURI.java:1669)
at org.das2.jythoncompletion.DataSetUrlCompletionTask.query(DataSetUrlCompletionTask.java:139)
at org.das2.jythoncompletion.JythonCompletionTask.queryStringLiteralArgument(JythonCompletionTask.java:1109)
at org.das2.jythoncompletion.JythonCompletionTask.doQuery(JythonCompletionTask.java:189)
at test.endtoend.Test038.getCompletionsCount(Test038.java:136)
at test.endtoend.Test038.doTestsCountCompletions(Test038.java:174)
at test.endtoend.Test038.doTests(Test038.java:58)
at test.endtoend.Test038.testGetParams(Test038.java:287)
at test.endtoend.Test038.main(Test038.java:303)
Oct 01, 2026 1:22:32 PM org.autoplot.datasource.DataSetURI getFileSystemCompletions
WARNING: parse exception: {0}
java.text.ParseException: failed attempt to parse int in "%s"
at org.das2.datum.DatumRangeUtil.parseInt(DatumRangeUtil.java:159)
at org.das2.datum.DatumRangeUtil.access$100(DatumRangeUtil.java:15)
at org.das2.datum.DatumRangeUtil$TimeRangeParser.parse(DatumRangeUtil.java:1224)
at org.das2.datum.DatumRangeUtil.parseTimeRange(DatumRangeUtil.java:1607)
at org.autoplot.datasource.DataSetURI.getFileSystemCompletions(DataSetURI.java:1971)
at org.autoplot.datasource.DataSetURI.getFileSystemCompletions(DataSetURI.java:1825)
at org.autoplot.datasource.DataSetURI.getCompletions(DataSetURI.java:1669)
at org.das2.jythoncompletion.DataSetUrlCompletionTask.query(DataSetUrlCompletionTask.java:139)
at org.das2.jythoncompletion.JythonCompletionTask.queryStringLiteralArgument(JythonCompletionTask.java:1109)
at org.das2.jythoncompletion.JythonCompletionTask.doQuery(JythonCompletionTask.java:189)
at test.endtoend.Test038.getCompletionsCount(Test038.java:136)
at test.endtoend.Test038.doTestsCountCompletions(Test038.java:174)
at test.endtoend.Test038.doTests(Test038.java:58)
at test.endtoend.Test038.testGetParams(Test038.java:287)
at test.endtoend.Test038.main(Test038.java:303)
Oct 01, 2026 1:22:32 PM org.das2.jythoncompletion.DataSetUrlCompletionTask query
SEVERE: null
java.lang.NullPointerException
at java.util.regex.Matcher.getTextLength(Matcher.java:1283)
at java.util.regex.Matcher.reset(Matcher.java:309)
at java.util.regex.Matcher.<init>(Matcher.java:229)
at java.util.regex.Pattern.matcher(Pattern.java:1093)
at org.das2.fsm.FileStorageModel.getDatumRangeFor(FileStorageModel.java:394)
at org.das2.fsm.FileStorageModel.getRangeFor(FileStorageModel.java:821)
at org.autoplot.datasource.DataSetURI.getFileSystemCompletions(DataSetURI.java:1991)
at org.autoplot.datasource.DataSetURI.getFileSystemCompletions(DataSetURI.java:1825)
at org.autoplot.datasource.DataSetURI.getCompletions(DataSetURI.java:1669)
at org.das2.jythoncompletion.DataSetUrlCompletionTask.query(DataSetUrlCompletionTask.java:139)
at org.das2.jythoncompletion.JythonCompletionTask.queryStringLiteralArgument(JythonCompletionTask.java:1109)
at org.das2.jythoncompletion.JythonCompletionTask.doQuery(JythonCompletionTask.java:189)
at test.endtoend.Test038.getCompletionsCount(Test038.java:136)
at test.endtoend.Test038.doTestsCountCompletions(Test038.java:174)
at test.endtoend.Test038.doTests(Test038.java:58)
at test.endtoend.Test038.testGetParams(Test038.java:287)
at test.endtoend.Test038.main(Test038.java:303)
Oct 01, 2026 1:22:32 PM org.autoplot.datasource.DataSetURI getFileSystemCompletions
WARNING: parse exception: {0}
java.text.ParseException: failed attempt to parse int in "%s"
at org.das2.datum.DatumRangeUtil.parseInt(DatumRangeUtil.java:159)
at org.das2.datum.DatumRangeUtil.access$100(DatumRangeUtil.java:15)
at org.das2.datum.DatumRangeUtil$TimeRangeParser.parse(DatumRangeUtil.java:1224)
at org.das2.datum.DatumRangeUtil.parseTimeRange(DatumRangeUtil.java:1607)
at org.autoplot.datasource.DataSetURI.getFileSystemCompletions(DataSetURI.java:1971)
at org.autoplot.datasource.DataSetURI.getFileSystemCompletions(DataSetURI.java:1825)
at org.autoplot.datasource.DataSetURI.getCompletions(DataSetURI.java:1669)
at org.das2.jythoncompletion.DataSetUrlCompletionTask.query(DataSetUrlCompletionTask.java:139)
at org.das2.jythoncompletion.JythonCompletionTask.queryStringLiteralArgument(JythonCompletionTask.java:1109)
at org.das2.jythoncompletion.JythonCompletionTask.doQuery(JythonCompletionTask.java:189)
at test.endtoend.Test038.getCompletionsCount(Test038.java:136)
at test.endtoend.Test038.doTestsCountCompletions(Test038.java:174)
at test.endtoend.Test038.doTests(Test038.java:58)
at test.endtoend.Test038.testGetParams(Test038.java:287)
at test.endtoend.Test038.main(Test038.java:303)
Oct 01, 2026 1:22:32 PM org.das2.jythoncompletion.DataSetUrlCompletionTask query
SEVERE: null
java.lang.NullPointerException
at java.util.regex.Matcher.getTextLength(Matcher.java:1283)
at java.util.regex.Matcher.reset(Matcher.java:309)
at java.util.regex.Matcher.<init>(Matcher.java:229)
at java.util.regex.Pattern.matcher(Pattern.java:1093)
at org.das2.fsm.FileStorageModel.getDatumRangeFor(FileStorageModel.java:394)
at org.das2.fsm.FileStorageModel.getRangeFor(FileStorageModel.java:821)
at org.autoplot.datasource.DataSetURI.getFileSystemCompletions(DataSetURI.java:1991)
at org.autoplot.datasource.DataSetURI.getFileSystemCompletions(DataSetURI.java:1825)
at org.autoplot.datasource.DataSetURI.getCompletions(DataSetURI.java:1669)
at org.das2.jythoncompletion.DataSetUrlCompletionTask.query(DataSetUrlCompletionTask.java:139)
at org.das2.jythoncompletion.JythonCompletionTask.queryStringLiteralArgument(JythonCompletionTask.java:1109)
at org.das2.jythoncompletion.JythonCompletionTask.doQuery(JythonCompletionTask.java:189)
at test.endtoend.Test038.getCompletionsCount(Test038.java:136)
at test.endtoend.Test038.doTestsCountCompletions(Test038.java:174)
at test.endtoend.Test038.doTests(Test038.java:58)
at test.endtoend.Test038.testGetParams(Test038.java:287)
at test.endtoend.Test038.main(Test038.java:303)
Oct 01, 2026 1:22:32 PM org.autoplot.datasource.DataSetURI getFileSystemCompletions
WARNING: parse exception: {0}
java.text.ParseException: failed attempt to parse int in "%s"
at org.das2.datum.DatumRangeUtil.parseInt(DatumRangeUtil.java:159)
at org.das2.datum.DatumRangeUtil.access$100(DatumRangeUtil.java:15)
at org.das2.datum.DatumRangeUtil$TimeRangeParser.parse(DatumRangeUtil.java:1224)
at org.das2.datum.DatumRangeUtil.parseTimeRange(DatumRangeUtil.java:1607)
at org.autoplot.datasource.DataSetURI.getFileSystemCompletions(DataSetURI.java:1971)
at org.autoplot.datasource.DataSetURI.getFileSystemCompletions(DataSetURI.java:1825)
at org.autoplot.datasource.DataSetURI.getCompletions(DataSetURI.java:1669)
at org.das2.jythoncompletion.DataSetUrlCompletionTask.query(DataSetUrlCompletionTask.java:139)
at org.das2.jythoncompletion.JythonCompletionTask.queryStringLiteralArgument(JythonCompletionTask.java:1109)
at org.das2.jythoncompletion.JythonCompletionTask.doQuery(JythonCompletionTask.java:189)
at test.endtoend.Test038.getCompletionsCount(Test038.java:136)
at test.endtoend.Test038.doTestsCountCompletions(Test038.java:174)
at test.endtoend.Test038.doTests(Test038.java:58)
at test.endtoend.Test038.testGetParams(Test038.java:287)
at test.endtoend.Test038.main(Test038.java:303)
Oct 01, 2026 1:22:32 PM org.das2.jythoncompletion.DataSetUrlCompletionTask query
SEVERE: null
java.lang.NullPointerException
Oct 01, 2026 1:22:32 PM org.das2.jythoncompletion.DataSetUrlCompletionTask query
SEVERE: unable to find any files matching
vap+cdf:http://emfisis.physics.uiowa.edu/Flight/RBSP-A/Quick-Look/$Y/$m/$d/rbsp-a_magnetometer_uvw_emfisis-Quick-Look_$Y$m$d_v$(v,sep).cdf?timerange=%s&Mag
java.io.FileNotFoundException: unable to find any files matching
vap+cdf:http://emfisis.physics.uiowa.edu/Flight/RBSP-A/Quick-Look/$Y/$m/$d/rbsp-a_magnetometer_uvw_emfisis-Quick-Look_$Y$m$d_v$(v,sep).cdf?timerange=%s&Mag
at org.autoplot.aggregator.AggregatingDataSourceFactory.getDelegateDataSourceCompletionContext(AggregatingDataSourceFactory.java:230)
at org.autoplot.aggregator.AggregatingDataSourceFactory.getCompletions(AggregatingDataSourceFactory.java:358)
at org.autoplot.datasource.DataSetURI.getFactoryCompletions(DataSetURI.java:2404)
at org.autoplot.datasource.DataSetURI.getCompletions(DataSetURI.java:1652)
at org.das2.jythoncompletion.DataSetUrlCompletionTask.query(DataSetUrlCompletionTask.java:139)
at org.das2.jythoncompletion.JythonCompletionTask.queryStringLiteralArgument(JythonCompletionTask.java:1109)
at org.das2.jythoncompletion.JythonCompletionTask.doQuery(JythonCompletionTask.java:189)
at test.endtoend.Test038.getCompletionsCount(Test038.java:136)
at test.endtoend.Test038.doTestsCountCompletions(Test038.java:174)
at test.endtoend.Test038.doTests(Test038.java:58)
at test.endtoend.Test038.testGetParams(Test038.java:287)
at test.endtoend.Test038.main(Test038.java:303)
Oct 01, 2026 1:22:32 PM org.das2.jythoncompletion.DataSetUrlCompletionTask query
SEVERE: null
java.lang.NullPointerException
Oct 01, 2026 1:22:32 PM org.das2.util.filesystem.HttpFileSystem createHttpFileSystem
WARNING: filesystem is offline: http://emfisis.physics.uiowa.edu/Flight/
Oct 01, 2026 1:22:32 PM org.autoplot.datasource.DataSetURI getFileSystemCompletions
WARNING: parse exception: {0}
java.text.ParseException: failed attempt to parse int in "%s"
at org.das2.datum.DatumRangeUtil.parseInt(DatumRangeUtil.java:159)
at org.das2.datum.DatumRangeUtil.access$100(DatumRangeUtil.java:15)
at org.das2.datum.DatumRangeUtil$TimeRangeParser.parse(DatumRangeUtil.java:1224)
at org.das2.datum.DatumRangeUtil.parseTimeRange(DatumRangeUtil.java:1607)
at org.autoplot.datasource.DataSetURI.getFileSystemCompletions(DataSetURI.java:1971)
at org.autoplot.datasource.DataSetURI.getFileSystemCompletions(DataSetURI.java:1825)
at org.autoplot.datasource.DataSetURI.getCompletions(DataSetURI.java:1669)
at org.das2.jythoncompletion.DataSetUrlCompletionTask.query(DataSetUrlCompletionTask.java:139)
at org.das2.jythoncompletion.JythonCompletionTask.queryStringLiteralArgument(JythonCompletionTask.java:1109)
at org.das2.jythoncompletion.JythonCompletionTask.doQuery(JythonCompletionTask.java:189)
at test.endtoend.Test038.getCompletionsCount(Test038.java:136)
at test.endtoend.Test038.doTestsCountCompletions(Test038.java:174)
at test.endtoend.Test038.doTests(Test038.java:58)
at test.endtoend.Test038.testGetParams(Test038.java:287)
at test.endtoend.Test038.main(Test038.java:303)
Oct 01, 2026 1:22:32 PM org.das2.jythoncompletion.DataSetUrlCompletionTask query
SEVERE: null
java.lang.NullPointerException
Oct 01, 2026 1:22:32 PM org.autoplot.datasource.DataSetURI getFileSystemCompletions
WARNING: parse exception: {0}
java.text.ParseException: failed attempt to parse int in "%s"
at org.das2.datum.DatumRangeUtil.parseInt(DatumRangeUtil.java:159)
at org.das2.datum.DatumRangeUtil.access$100(DatumRangeUtil.java:15)
at org.das2.datum.DatumRangeUtil$TimeRangeParser.parse(DatumRangeUtil.java:1224)
at org.das2.datum.DatumRangeUtil.parseTimeRange(DatumRangeUtil.java:1607)
at org.autoplot.datasource.DataSetURI.getFileSystemCompletions(DataSetURI.java:1971)
at org.autoplot.datasource.DataSetURI.getFileSystemCompletions(DataSetURI.java:1825)
at org.autoplot.datasource.DataSetURI.getCompletions(DataSetURI.java:1669)
at org.das2.jythoncompletion.DataSetUrlCompletionTask.query(DataSetUrlCompletionTask.java:139)
at org.das2.jythoncompletion.JythonCompletionTask.queryStringLiteralArgument(JythonCompletionTask.java:1109)
at org.das2.jythoncompletion.JythonCompletionTask.doQuery(JythonCompletionTask.java:189)
at test.endtoend.Test038.getCompletionsCount(Test038.java:136)
at test.endtoend.Test038.doTestsCountCompletions(Test038.java:174)
at test.endtoend.Test038.doTests(Test038.java:58)
at test.endtoend.Test038.testGetParams(Test038.java:287)
at test.endtoend.Test038.main(Test038.java:303)
Oct 01, 2026 1:22:32 PM org.das2.jythoncompletion.DataSetUrlCompletionTask query
SEVERE: null
java.lang.NullPointerException
Oct 01, 2026 1:22:32 PM org.autoplot.datasource.DataSetURI getFileSystemCompletions
WARNING: parse exception: {0}
java.text.ParseException: failed attempt to parse int in "%s"
at org.das2.datum.DatumRangeUtil.parseInt(DatumRangeUtil.java:159)
at org.das2.datum.DatumRangeUtil.access$100(DatumRangeUtil.java:15)
at org.das2.datum.DatumRangeUtil$TimeRangeParser.parse(DatumRangeUtil.java:1224)
at org.das2.datum.DatumRangeUtil.parseTimeRange(DatumRangeUtil.java:1607)
at org.autoplot.datasource.DataSetURI.getFileSystemCompletions(DataSetURI.java:1971)
at org.autoplot.datasource.DataSetURI.getFileSystemCompletions(DataSetURI.java:1825)
at org.autoplot.datasource.DataSetURI.getCompletions(DataSetURI.java:1669)
at org.das2.jythoncompletion.DataSetUrlCompletionTask.query(DataSetUrlCompletionTask.java:139)
at org.das2.jythoncompletion.JythonCompletionTask.queryStringLiteralArgument(JythonCompletionTask.java:1109)
at org.das2.jythoncompletion.JythonCompletionTask.doQuery(JythonCompletionTask.java:189)
at test.endtoend.Test038.getCompletionsCount(Test038.java:136)
at test.endtoend.Test038.doTestsCountCompletions(Test038.java:174)
at test.endtoend.Test038.doTests(Test038.java:58)
at test.endtoend.Test038.testGetParams(Test038.java:287)
at test.endtoend.Test038.main(Test038.java:303)
Oct 01, 2026 1:22:32 PM org.das2.jythoncompletion.DataSetUrlCompletionTask query
SEVERE: null
java.lang.NullPointerException
Oct 01, 2026 1:22:32 PM org.autoplot.datasource.DataSetURI getFileSystemCompletions
WARNING: parse exception: {0}
java.text.ParseException: failed attempt to parse int in "%s"
at org.das2.datum.DatumRangeUtil.parseInt(DatumRangeUtil.java:159)
at org.das2.datum.DatumRangeUtil.access$100(DatumRangeUtil.java:15)
at org.das2.datum.DatumRangeUtil$TimeRangeParser.parse(DatumRangeUtil.java:1224)
at org.das2.datum.DatumRangeUtil.parseTimeRange(DatumRangeUtil.java:1607)
at org.autoplot.datasource.DataSetURI.getFileSystemCompletions(DataSetURI.java:1971)
at org.autoplot.datasource.DataSetURI.getFileSystemCompletions(DataSetURI.java:1825)
at org.autoplot.datasource.DataSetURI.getCompletions(DataSetURI.java:1669)
at org.das2.jythoncompletion.DataSetUrlCompletionTask.query(DataSetUrlCompletionTask.java:139)
at org.das2.jythoncompletion.JythonCompletionTask.queryStringLiteralArgument(JythonCompletionTask.java:1109)
at org.das2.jythoncompletion.JythonCompletionTask.doQuery(JythonCompletionTask.java:189)
at test.endtoend.Test038.getCompletionsCount(Test038.java:136)
at test.endtoend.Test038.doTestsCountCompletions(Test038.java:174)
at test.endtoend.Test038.doTests(Test038.java:58)
at test.endtoend.Test038.testGetParams(Test038.java:287)
at test.endtoend.Test038.main(Test038.java:303)
Oct 01, 2026 1:22:32 PM org.das2.jythoncompletion.DataSetUrlCompletionTask query
SEVERE: null
java.lang.NullPointerException
Oct 01, 2026 1:22:32 PM org.autoplot.datasource.DataSetURI getFileSystemCompletions
WARNING: parse exception: {0}
java.text.ParseException: failed attempt to parse int in "%s"
at org.das2.datum.DatumRangeUtil.parseInt(DatumRangeUtil.java:159)
at org.das2.datum.DatumRangeUtil.access$100(DatumRangeUtil.java:15)
at org.das2.datum.DatumRangeUtil$TimeRangeParser.parse(DatumRangeUtil.java:1224)
at org.das2.datum.DatumRangeUtil.parseTimeRange(DatumRangeUtil.java:1607)
at org.autoplot.datasource.DataSetURI.getFileSystemCompletions(DataSetURI.java:1971)
at org.autoplot.datasource.DataSetURI.getFileSystemCompletions(DataSetURI.java:1825)
at org.autoplot.datasource.DataSetURI.getCompletions(DataSetURI.java:1669)
at org.das2.jythoncompletion.DataSetUrlCompletionTask.query(DataSetUrlCompletionTask.java:139)
at org.das2.jythoncompletion.JythonCompletionTask.queryStringLiteralArgument(JythonCompletionTask.java:1109)
at org.das2.jythoncompletion.JythonCompletionTask.doQuery(JythonCompletionTask.java:189)
at test.endtoend.Test038.getCompletionsCount(Test038.java:136)
at test.endtoend.Test038.doTestsCountCompletions(Test038.java:174)
at test.endtoend.Test038.doTests(Test038.java:58)
at test.endtoend.Test038.testGetParams(Test038.java:287)
at test.endtoend.Test038.main(Test038.java:303)
Oct 01, 2026 1:22:32 PM org.das2.jythoncompletion.DataSetUrlCompletionTask query
SEVERE: null
java.lang.NullPointerException
Oct 01, 2026 1:22:32 PM org.autoplot.datasource.DataSetURI getFileSystemCompletions
WARNING: parse exception: {0}
java.text.ParseException: failed attempt to parse int in "%s"
at org.das2.datum.DatumRangeUtil.parseInt(DatumRangeUtil.java:159)
at org.das2.datum.DatumRangeUtil.access$100(DatumRangeUtil.java:15)
at org.das2.datum.DatumRangeUtil$TimeRangeParser.parse(DatumRangeUtil.java:1224)
at org.das2.datum.DatumRangeUtil.parseTimeRange(DatumRangeUtil.java:1607)
at org.autoplot.datasource.DataSetURI.getFileSystemCompletions(DataSetURI.java:1971)
at org.autoplot.datasource.DataSetURI.getFileSystemCompletions(DataSetURI.java:1825)
at org.autoplot.datasource.DataSetURI.getCompletions(DataSetURI.java:1669)
at org.das2.jythoncompletion.DataSetUrlCompletionTask.query(DataSetUrlCompletionTask.java:139)
at org.das2.jythoncompletion.JythonCompletionTask.queryStringLiteralArgument(JythonCompletionTask.java:1109)
at org.das2.jythoncompletion.JythonCompletionTask.doQuery(JythonCompletionTask.java:189)
at test.endtoend.Test038.getCompletionsCount(Test038.java:136)
at test.endtoend.Test038.doTestsCountCompletions(Test038.java:174)
at test.endtoend.Test038.doTests(Test038.java:58)
at test.endtoend.Test038.testGetParams(Test038.java:287)
at test.endtoend.Test038.main(Test038.java:303)
Oct 01, 2026 1:22:32 PM org.das2.jythoncompletion.DataSetUrlCompletionTask query
SEVERE: null
java.lang.NullPointerException
Oct 01, 2026 1:22:32 PM org.autoplot.datasource.DataSetURI getFileSystemCompletions
WARNING: parse exception: {0}
java.text.ParseException: failed attempt to parse int in "%s"
at org.das2.datum.DatumRangeUtil.parseInt(DatumRangeUtil.java:159)
at org.das2.datum.DatumRangeUtil.access$100(DatumRangeUtil.java:15)
at org.das2.datum.DatumRangeUtil$TimeRangeParser.parse(DatumRangeUtil.java:1224)
at org.das2.datum.DatumRangeUtil.parseTimeRange(DatumRangeUtil.java:1607)
at org.autoplot.datasource.DataSetURI.getFileSystemCompletions(DataSetURI.java:1971)
at org.autoplot.datasource.DataSetURI.getFileSystemCompletions(DataSetURI.java:1825)
at org.autoplot.datasource.DataSetURI.getCompletions(DataSetURI.java:1669)
at org.das2.jythoncompletion.DataSetUrlCompletionTask.query(DataSetUrlCompletionTask.java:139)
at org.das2.jythoncompletion.JythonCompletionTask.queryStringLiteralArgument(JythonCompletionTask.java:1109)
at org.das2.jythoncompletion.JythonCompletionTask.doQuery(JythonCompletionTask.java:189)
at test.endtoend.Test038.getCompletionsCount(Test038.java:136)
at test.endtoend.Test038.doTestsCountCompletions(Test038.java:174)
at test.endtoend.Test038.doTests(Test038.java:58)
at test.endtoend.Test038.testGetParams(Test038.java:287)
at test.endtoend.Test038.main(Test038.java:303)
Oct 01, 2026 1:22:32 PM org.das2.jythoncompletion.DataSetUrlCompletionTask query
SEVERE: null
java.lang.NullPointerException
Oct 01, 2026 1:22:32 PM org.das2.jythoncompletion.DataSetUrlCompletionTask query
SEVERE: unable to find any files matching
vap+cdf:http://emfisis.physics.uiowa.edu/Flight/RBSP-A/Quick-Look/$Y/$m/$d/rbsp-a_magnetometer_uvw_emfisis-Quick-Look_$Y$m$d_v$(v,sep).cdf?timerange=%s&Mag[::%s]
java.io.FileNotFoundException: unable to find any files matching
vap+cdf:http://emfisis.physics.uiowa.edu/Flight/RBSP-A/Quick-Look/$Y/$m/$d/rbsp-a_magnetometer_uvw_emfisis-Quick-Look_$Y$m$d_v$(v,sep).cdf?timerange=%s&Mag[::%s]
at org.autoplot.aggregator.AggregatingDataSourceFactory.getDelegateDataSourceCompletionContext(AggregatingDataSourceFactory.java:230)
at org.autoplot.aggregator.AggregatingDataSourceFactory.getCompletions(AggregatingDataSourceFactory.java:358)
at org.autoplot.datasource.DataSetURI.getFactoryCompletions(DataSetURI.java:2404)
at org.autoplot.datasource.DataSetURI.getCompletions(DataSetURI.java:1652)
at org.das2.jythoncompletion.DataSetUrlCompletionTask.query(DataSetUrlCompletionTask.java:139)
at org.das2.jythoncompletion.JythonCompletionTask.queryStringLiteralArgument(JythonCompletionTask.java:1109)
at org.das2.jythoncompletion.JythonCompletionTask.doQuery(JythonCompletionTask.java:189)
at test.endtoend.Test038.getCompletionsCount(Test038.java:136)
at test.endtoend.Test038.doTestsCountCompletions(Test038.java:174)
at test.endtoend.Test038.doTests(Test038.java:58)
at test.endtoend.Test038.testGetParams(Test038.java:287)
at test.endtoend.Test038.main(Test038.java:303)
Oct 01, 2026 1:22:32 PM org.das2.jythoncompletion.DataSetUrlCompletionTask query
SEVERE: unable to find any files matching
vap+cdf:http://emfisis.physics.uiowa.edu/Flight/RBSP-A/Quick-Look/$Y/$m/$d/rbsp-a_magnetometer_uvw_emfisis-Quick-Look_$Y$m$d_v$(v,sep).cdf?timerange=%s&Mag[::%s]
java.io.FileNotFoundException: unable to find any files matching
vap+cdf:http://emfisis.physics.uiowa.edu/Flight/RBSP-A/Quick-Look/$Y/$m/$d/rbsp-a_magnetometer_uvw_emfisis-Quick-Look_$Y$m$d_v$(v,sep).cdf?timerange=%s&Mag[::%s]
at org.autoplot.aggregator.AggregatingDataSourceFactory.getDelegateDataSourceCompletionContext(AggregatingDataSourceFactory.java:230)
at org.autoplot.aggregator.AggregatingDataSourceFactory.getCompletions(AggregatingDataSourceFactory.java:358)
at org.autoplot.datasource.DataSetURI.getFactoryCompletions(DataSetURI.java:2483)
at org.autoplot.datasource.DataSetURI.getCompletions(DataSetURI.java:1652)
at org.das2.jythoncompletion.DataSetUrlCompletionTask.query(DataSetUrlCompletionTask.java:139)
at org.das2.jythoncompletion.JythonCompletionTask.queryStringLiteralArgument(JythonCompletionTask.java:1109)
at org.das2.jythoncompletion.JythonCompletionTask.doQuery(JythonCompletionTask.java:189)
at test.endtoend.Test038.getCompletionsCount(Test038.java:136)
at test.endtoend.Test038.doTestsCountCompletions(Test038.java:174)
at test.endtoend.Test038.doTests(Test038.java:58)
at test.endtoend.Test038.testGetParams(Test038.java:287)
at test.endtoend.Test038.main(Test038.java:303)
Oct 01, 2026 1:22:32 PM org.das2.jythoncompletion.DataSetUrlCompletionTask query
SEVERE: unable to find any files matching
vap+cdf:http://emfisis.physics.uiowa.edu/Flight/RBSP-A/Quick-Look/$Y/$m/$d/rbsp-a_magnetometer_uvw_emfisis-Quick-Look_$Y$m$d_v$(v,sep).cdf?timerange=%s&Mag[::%s]
java.io.FileNotFoundException: unable to find any files matching
vap+cdf:http://emfisis.physics.uiowa.edu/Flight/RBSP-A/Quick-Look/$Y/$m/$d/rbsp-a_magnetometer_uvw_emfisis-Quick-Look_$Y$m$d_v$(v,sep).cdf?timerange=%s&Mag[::%s]
at org.autoplot.aggregator.AggregatingDataSourceFactory.getDelegateDataSourceCompletionContext(AggregatingDataSourceFactory.java:230)
at org.autoplot.aggregator.AggregatingDataSourceFactory.getCompletions(AggregatingDataSourceFactory.java:358)
at org.autoplot.datasource.DataSetURI.getFactoryCompletions(DataSetURI.java:2404)
at org.autoplot.datasource.DataSetURI.getCompletions(DataSetURI.java:1652)
at org.das2.jythoncompletion.DataSetUrlCompletionTask.query(DataSetUrlCompletionTask.java:139)
at org.das2.jythoncompletion.JythonCompletionTask.queryStringLiteralArgument(JythonCompletionTask.java:1109)
at org.das2.jythoncompletion.JythonCompletionTask.doQuery(JythonCompletionTask.java:189)
at test.endtoend.Test038.getCompletionsCount(Test038.java:136)
at test.endtoend.Test038.doTestsCountCompletions(Test038.java:174)
at test.endtoend.Test038.doTests(Test038.java:58)
at test.endtoend.Test038.testGetParams(Test038.java:287)
at test.endtoend.Test038.main(Test038.java:303)
overwriting /var/local/jenkins/workspace/autoplot-test038/test038.fce_A.jyds.cdf
overwriting /var/local/jenkins/workspace/autoplot-test038/test038.fce_A.jyds.cdf
overwriting /var/local/jenkins/workspace/autoplot-test038/test038.fce_A.jyds.cdf
== test 007: /home/jbf/ct/hudson/script/test038/fce_A_2.jyds ==
timerange=2012-09-26
subsamp=0
typ=fce
read params in 16 millis: /home/jbf/ct/hudson/script/test038/fce_A_2.jyds
== test 007: /home/jbf/ct/hudson/script/test038/fce_A_2.jyds ==
timerange=2012-09-26
subsamp=0
typ=fce
read params in 14 millis: /home/jbf/ct/hudson/script/test038/fce_A_2.jyds
== test 007: /home/jbf/ct/hudson/script/test038/fce_A_2.jyds ==
Oct 01, 2026 1:22:36 PM org.das2.jythoncompletion.DataSetUrlCompletionTask query
SEVERE: null
java.lang.NullPointerException
Oct 01, 2026 1:22:36 PM org.autoplot.datasource.DataSetURI getFileSystemCompletions
WARNING: parse exception: {0}
java.text.ParseException: failed attempt to parse int in "%s"
at org.das2.datum.DatumRangeUtil.parseInt(DatumRangeUtil.java:159)
at org.das2.datum.DatumRangeUtil.access$100(DatumRangeUtil.java:15)
at org.das2.datum.DatumRangeUtil$TimeRangeParser.parse(DatumRangeUtil.java:1224)
at org.das2.datum.DatumRangeUtil.parseTimeRange(DatumRangeUtil.java:1607)
at org.autoplot.datasource.DataSetURI.getFileSystemCompletions(DataSetURI.java:1971)
at org.autoplot.datasource.DataSetURI.getFileSystemCompletions(DataSetURI.java:1825)
at org.autoplot.datasource.DataSetURI.getCompletions(DataSetURI.java:1669)
at org.das2.jythoncompletion.DataSetUrlCompletionTask.query(DataSetUrlCompletionTask.java:139)
at org.das2.jythoncompletion.JythonCompletionTask.queryStringLiteralArgument(JythonCompletionTask.java:1109)
at org.das2.jythoncompletion.JythonCompletionTask.doQuery(JythonCompletionTask.java:189)
at test.endtoend.Test038.getCompletionsCount(Test038.java:136)
at test.endtoend.Test038.doTestsCountCompletions(Test038.java:174)
at test.endtoend.Test038.doTests(Test038.java:58)
at test.endtoend.Test038.testGetParams(Test038.java:288)
at test.endtoend.Test038.main(Test038.java:303)
Oct 01, 2026 1:22:36 PM org.das2.jythoncompletion.DataSetUrlCompletionTask query
SEVERE: null
java.lang.NullPointerException
Oct 01, 2026 1:22:36 PM org.autoplot.datasource.DataSetURI getFileSystemCompletions
WARNING: parse exception: {0}
java.text.ParseException: failed attempt to parse int in "%s"
at org.das2.datum.DatumRangeUtil.parseInt(DatumRangeUtil.java:159)
at org.das2.datum.DatumRangeUtil.access$100(DatumRangeUtil.java:15)
at org.das2.datum.DatumRangeUtil$TimeRangeParser.parse(DatumRangeUtil.java:1224)
at org.das2.datum.DatumRangeUtil.parseTimeRange(DatumRangeUtil.java:1607)
at org.autoplot.datasource.DataSetURI.getFileSystemCompletions(DataSetURI.java:1971)
at org.autoplot.datasource.DataSetURI.getFileSystemCompletions(DataSetURI.java:1825)
at org.autoplot.datasource.DataSetURI.getCompletions(DataSetURI.java:1669)
at org.das2.jythoncompletion.DataSetUrlCompletionTask.query(DataSetUrlCompletionTask.java:139)
at org.das2.jythoncompletion.JythonCompletionTask.queryStringLiteralArgument(JythonCompletionTask.java:1109)
at org.das2.jythoncompletion.JythonCompletionTask.doQuery(JythonCompletionTask.java:189)
at test.endtoend.Test038.getCompletionsCount(Test038.java:136)
at test.endtoend.Test038.doTestsCountCompletions(Test038.java:174)
at test.endtoend.Test038.doTests(Test038.java:58)
at test.endtoend.Test038.testGetParams(Test038.java:288)
at test.endtoend.Test038.main(Test038.java:303)
Oct 01, 2026 1:22:36 PM org.das2.jythoncompletion.DataSetUrlCompletionTask query
SEVERE: null
java.lang.NullPointerException
Oct 01, 2026 1:22:36 PM org.autoplot.datasource.DataSetURI getFileSystemCompletions
WARNING: parse exception: {0}
java.text.ParseException: failed attempt to parse int in "%s"
at org.das2.datum.DatumRangeUtil.parseInt(DatumRangeUtil.java:159)
at org.das2.datum.DatumRangeUtil.access$100(DatumRangeUtil.java:15)
at org.das2.datum.DatumRangeUtil$TimeRangeParser.parse(DatumRangeUtil.java:1224)
at org.das2.datum.DatumRangeUtil.parseTimeRange(DatumRangeUtil.java:1607)
at org.autoplot.datasource.DataSetURI.getFileSystemCompletions(DataSetURI.java:1971)
at org.autoplot.datasource.DataSetURI.getFileSystemCompletions(DataSetURI.java:1825)
at org.autoplot.datasource.DataSetURI.getCompletions(DataSetURI.java:1669)
at org.das2.jythoncompletion.DataSetUrlCompletionTask.query(DataSetUrlCompletionTask.java:139)
at org.das2.jythoncompletion.JythonCompletionTask.queryStringLiteralArgument(JythonCompletionTask.java:1109)
at org.das2.jythoncompletion.JythonCompletionTask.doQuery(JythonCompletionTask.java:189)
at test.endtoend.Test038.getCompletionsCount(Test038.java:136)
at test.endtoend.Test038.doTestsCountCompletions(Test038.java:174)
at test.endtoend.Test038.doTests(Test038.java:58)
at test.endtoend.Test038.testGetParams(Test038.java:288)
at test.endtoend.Test038.main(Test038.java:303)
Oct 01, 2026 1:22:36 PM org.das2.jythoncompletion.DataSetUrlCompletionTask query
SEVERE: null
java.lang.NullPointerException
Oct 01, 2026 1:22:36 PM org.autoplot.datasource.DataSetURI getFileSystemCompletions
WARNING: parse exception: {0}
java.text.ParseException: failed attempt to parse int in "%s"
at org.das2.datum.DatumRangeUtil.parseInt(DatumRangeUtil.java:159)
at org.das2.datum.DatumRangeUtil.access$100(DatumRangeUtil.java:15)
at org.das2.datum.DatumRangeUtil$TimeRangeParser.parse(DatumRangeUtil.java:1224)
at org.das2.datum.DatumRangeUtil.parseTimeRange(DatumRangeUtil.java:1607)
at org.autoplot.datasource.DataSetURI.getFileSystemCompletions(DataSetURI.java:1971)
at org.autoplot.datasource.DataSetURI.getFileSystemCompletions(DataSetURI.java:1825)
at org.autoplot.datasource.DataSetURI.getCompletions(DataSetURI.java:1669)
at org.das2.jythoncompletion.DataSetUrlCompletionTask.query(DataSetUrlCompletionTask.java:139)
at org.das2.jythoncompletion.JythonCompletionTask.queryStringLiteralArgument(JythonCompletionTask.java:1109)
at org.das2.jythoncompletion.JythonCompletionTask.doQuery(JythonCompletionTask.java:189)
at test.endtoend.Test038.getCompletionsCount(Test038.java:136)
at test.endtoend.Test038.doTestsCountCompletions(Test038.java:174)
at test.endtoend.Test038.doTests(Test038.java:58)
at test.endtoend.Test038.testGetParams(Test038.java:288)
at test.endtoend.Test038.main(Test038.java:303)
Oct 01, 2026 1:22:36 PM org.das2.jythoncompletion.DataSetUrlCompletionTask query
SEVERE: null
java.lang.NullPointerException
Oct 01, 2026 1:22:36 PM org.autoplot.datasource.DataSetURI getFileSystemCompletions
WARNING: parse exception: {0}
java.text.ParseException: failed attempt to parse int in "%s"
at org.das2.datum.DatumRangeUtil.parseInt(DatumRangeUtil.java:159)
at org.das2.datum.DatumRangeUtil.access$100(DatumRangeUtil.java:15)
at org.das2.datum.DatumRangeUtil$TimeRangeParser.parse(DatumRangeUtil.java:1224)
at org.das2.datum.DatumRangeUtil.parseTimeRange(DatumRangeUtil.java:1607)
at org.autoplot.datasource.DataSetURI.getFileSystemCompletions(DataSetURI.java:1971)
at org.autoplot.datasource.DataSetURI.getFileSystemCompletions(DataSetURI.java:1825)
at org.autoplot.datasource.DataSetURI.getCompletions(DataSetURI.java:1669)
at org.das2.jythoncompletion.DataSetUrlCompletionTask.query(DataSetUrlCompletionTask.java:139)
at org.das2.jythoncompletion.JythonCompletionTask.queryStringLiteralArgument(JythonCompletionTask.java:1109)
at org.das2.jythoncompletion.JythonCompletionTask.doQuery(JythonCompletionTask.java:189)
at test.endtoend.Test038.getCompletionsCount(Test038.java:136)
at test.endtoend.Test038.doTestsCountCompletions(Test038.java:174)
at test.endtoend.Test038.doTests(Test038.java:58)
at test.endtoend.Test038.testGetParams(Test038.java:288)
at test.endtoend.Test038.main(Test038.java:303)
Oct 01, 2026 1:22:36 PM org.das2.jythoncompletion.DataSetUrlCompletionTask query
SEVERE: null
java.lang.NullPointerException
Oct 01, 2026 1:22:36 PM org.das2.jythoncompletion.DataSetUrlCompletionTask query
SEVERE: unable to find any files matching
vap+cdf:http://emfisis.physics.uiowa.edu/Flight/RBSP-A/Quick-Look/$Y/$m/$d/rbsp-a_magnetometer_uvw_emfisis-Quick-Look_$Y$m$d_v$(v,sep).cdf?timerange=%s&Mag
java.io.FileNotFoundException: unable to find any files matching
vap+cdf:http://emfisis.physics.uiowa.edu/Flight/RBSP-A/Quick-Look/$Y/$m/$d/rbsp-a_magnetometer_uvw_emfisis-Quick-Look_$Y$m$d_v$(v,sep).cdf?timerange=%s&Mag
at org.autoplot.aggregator.AggregatingDataSourceFactory.getDelegateDataSourceCompletionContext(AggregatingDataSourceFactory.java:230)
at org.autoplot.aggregator.AggregatingDataSourceFactory.getCompletions(AggregatingDataSourceFactory.java:358)
at org.autoplot.datasource.DataSetURI.getFactoryCompletions(DataSetURI.java:2404)
at org.autoplot.datasource.DataSetURI.getCompletions(DataSetURI.java:1652)
at org.das2.jythoncompletion.DataSetUrlCompletionTask.query(DataSetUrlCompletionTask.java:139)
at org.das2.jythoncompletion.JythonCompletionTask.queryStringLiteralArgument(JythonCompletionTask.java:1109)
at org.das2.jythoncompletion.JythonCompletionTask.doQuery(JythonCompletionTask.java:189)
at test.endtoend.Test038.getCompletionsCount(Test038.java:136)
at test.endtoend.Test038.doTestsCountCompletions(Test038.java:174)
at test.endtoend.Test038.doTests(Test038.java:58)
at test.endtoend.Test038.testGetParams(Test038.java:288)
at test.endtoend.Test038.main(Test038.java:303)
Oct 01, 2026 1:22:36 PM org.autoplot.datasource.DataSetURI getFileSystemCompletions
WARNING: parse exception: {0}
java.text.ParseException: failed attempt to parse int in "%s"
at org.das2.datum.DatumRangeUtil.parseInt(DatumRangeUtil.java:159)
at org.das2.datum.DatumRangeUtil.access$100(DatumRangeUtil.java:15)
at org.das2.datum.DatumRangeUtil$TimeRangeParser.parse(DatumRangeUtil.java:1224)
at org.das2.datum.DatumRangeUtil.parseTimeRange(DatumRangeUtil.java:1607)
at org.autoplot.datasource.DataSetURI.getFileSystemCompletions(DataSetURI.java:1971)
at org.autoplot.datasource.DataSetURI.getFileSystemCompletions(DataSetURI.java:1825)
at org.autoplot.datasource.DataSetURI.getCompletions(DataSetURI.java:1669)
at org.das2.jythoncompletion.DataSetUrlCompletionTask.query(DataSetUrlCompletionTask.java:139)
at org.das2.jythoncompletion.JythonCompletionTask.queryStringLiteralArgument(JythonCompletionTask.java:1109)
at org.das2.jythoncompletion.JythonCompletionTask.doQuery(JythonCompletionTask.java:189)
at test.endtoend.Test038.getCompletionsCount(Test038.java:136)
at test.endtoend.Test038.doTestsCountCompletions(Test038.java:174)
at test.endtoend.Test038.doTests(Test038.java:58)
at test.endtoend.Test038.testGetParams(Test038.java:288)
at test.endtoend.Test038.main(Test038.java:303)
Oct 01, 2026 1:22:36 PM org.das2.jythoncompletion.DataSetUrlCompletionTask query
SEVERE: null
java.lang.NullPointerException
Oct 01, 2026 1:22:36 PM org.autoplot.datasource.DataSetURI getFileSystemCompletions
WARNING: parse exception: {0}
java.text.ParseException: failed attempt to parse int in "%s"
at org.das2.datum.DatumRangeUtil.parseInt(DatumRangeUtil.java:159)
at org.das2.datum.DatumRangeUtil.access$100(DatumRangeUtil.java:15)
at org.das2.datum.DatumRangeUtil$TimeRangeParser.parse(DatumRangeUtil.java:1224)
at org.das2.datum.DatumRangeUtil.parseTimeRange(DatumRangeUtil.java:1607)
at org.autoplot.datasource.DataSetURI.getFileSystemCompletions(DataSetURI.java:1971)
at org.autoplot.datasource.DataSetURI.getFileSystemCompletions(DataSetURI.java:1825)
at org.autoplot.datasource.DataSetURI.getCompletions(DataSetURI.java:1669)
at org.das2.jythoncompletion.DataSetUrlCompletionTask.query(DataSetUrlCompletionTask.java:139)
at org.das2.jythoncompletion.JythonCompletionTask.queryStringLiteralArgument(JythonCompletionTask.java:1109)
at org.das2.jythoncompletion.JythonCompletionTask.doQuery(JythonCompletionTask.java:189)
at test.endtoend.Test038.getCompletionsCount(Test038.java:136)
at test.endtoend.Test038.doTestsCountCompletions(Test038.java:174)
at test.endtoend.Test038.doTests(Test038.java:58)
at test.endtoend.Test038.testGetParams(Test038.java:288)
at test.endtoend.Test038.main(Test038.java:303)
Oct 01, 2026 1:22:36 PM org.das2.jythoncompletion.DataSetUrlCompletionTask query
SEVERE: null
java.lang.NullPointerException
Oct 01, 2026 1:22:36 PM org.autoplot.datasource.DataSetURI getFileSystemCompletions
WARNING: parse exception: {0}
java.text.ParseException: failed attempt to parse int in "%s"
at org.das2.datum.DatumRangeUtil.parseInt(DatumRangeUtil.java:159)
at org.das2.datum.DatumRangeUtil.access$100(DatumRangeUtil.java:15)
at org.das2.datum.DatumRangeUtil$TimeRangeParser.parse(DatumRangeUtil.java:1224)
at org.das2.datum.DatumRangeUtil.parseTimeRange(DatumRangeUtil.java:1607)
at org.autoplot.datasource.DataSetURI.getFileSystemCompletions(DataSetURI.java:1971)
at org.autoplot.datasource.DataSetURI.getFileSystemCompletions(DataSetURI.java:1825)
at org.autoplot.datasource.DataSetURI.getCompletions(DataSetURI.java:1669)
at org.das2.jythoncompletion.DataSetUrlCompletionTask.query(DataSetUrlCompletionTask.java:139)
at org.das2.jythoncompletion.JythonCompletionTask.queryStringLiteralArgument(JythonCompletionTask.java:1109)
at org.das2.jythoncompletion.JythonCompletionTask.doQuery(JythonCompletionTask.java:189)
at test.endtoend.Test038.getCompletionsCount(Test038.java:136)
at test.endtoend.Test038.doTestsCountCompletions(Test038.java:174)
at test.endtoend.Test038.doTests(Test038.java:58)
at test.endtoend.Test038.testGetParams(Test038.java:288)
at test.endtoend.Test038.main(Test038.java:303)
Oct 01, 2026 1:22:36 PM org.das2.jythoncompletion.DataSetUrlCompletionTask query
SEVERE: null
java.lang.NullPointerException
Oct 01, 2026 1:22:36 PM org.autoplot.datasource.DataSetURI getFileSystemCompletions
WARNING: parse exception: {0}
java.text.ParseException: failed attempt to parse int in "%s"
at org.das2.datum.DatumRangeUtil.parseInt(DatumRangeUtil.java:159)
at org.das2.datum.DatumRangeUtil.access$100(DatumRangeUtil.java:15)
at org.das2.datum.DatumRangeUtil$TimeRangeParser.parse(DatumRangeUtil.java:1224)
at org.das2.datum.DatumRangeUtil.parseTimeRange(DatumRangeUtil.java:1607)
at org.autoplot.datasource.DataSetURI.getFileSystemCompletions(DataSetURI.java:1971)
at org.autoplot.datasource.DataSetURI.getFileSystemCompletions(DataSetURI.java:1825)
at org.autoplot.datasource.DataSetURI.getCompletions(DataSetURI.java:1669)
at org.das2.jythoncompletion.DataSetUrlCompletionTask.query(DataSetUrlCompletionTask.java:139)
at org.das2.jythoncompletion.JythonCompletionTask.queryStringLiteralArgument(JythonCompletionTask.java:1109)
at org.das2.jythoncompletion.JythonCompletionTask.doQuery(JythonCompletionTask.java:189)
at test.endtoend.Test038.getCompletionsCount(Test038.java:136)
at test.endtoend.Test038.doTestsCountCompletions(Test038.java:174)
at test.endtoend.Test038.doTests(Test038.java:58)
at test.endtoend.Test038.testGetParams(Test038.java:288)
at test.endtoend.Test038.main(Test038.java:303)
Oct 01, 2026 1:22:36 PM org.das2.jythoncompletion.DataSetUrlCompletionTask query
SEVERE: null
java.lang.NullPointerException
Oct 01, 2026 1:22:36 PM org.das2.jythoncompletion.DataSetUrlCompletionTask query
SEVERE: unable to find any files matching
vap+cdf:http://emfisis.physics.uiowa.edu/Flight/RBSP-A/Quick-Look/$Y/$m/$d/rbsp-a_magnetometer_uvw_emfisis-Quick-Look_$Y$m$d_v$(v,sep).cdf?timerange=%s&Mag[::%s]
java.io.FileNotFoundException: unable to find any files matching
vap+cdf:http://emfisis.physics.uiowa.edu/Flight/RBSP-A/Quick-Look/$Y/$m/$d/rbsp-a_magnetometer_uvw_emfisis-Quick-Look_$Y$m$d_v$(v,sep).cdf?timerange=%s&Mag[::%s]
at org.autoplot.aggregator.AggregatingDataSourceFactory.getDelegateDataSourceCompletionContext(AggregatingDataSourceFactory.java:230)
at org.autoplot.aggregator.AggregatingDataSourceFactory.getCompletions(AggregatingDataSourceFactory.java:358)
at org.autoplot.datasource.DataSetURI.getFactoryCompletions(DataSetURI.java:2404)
at org.autoplot.datasource.DataSetURI.getCompletions(DataSetURI.java:1652)
at org.das2.jythoncompletion.DataSetUrlCompletionTask.query(DataSetUrlCompletionTask.java:139)
at org.das2.jythoncompletion.JythonCompletionTask.queryStringLiteralArgument(JythonCompletionTask.java:1109)
at org.das2.jythoncompletion.JythonCompletionTask.doQuery(JythonCompletionTask.java:189)
at test.endtoend.Test038.getCompletionsCount(Test038.java:136)
at test.endtoend.Test038.doTestsCountCompletions(Test038.java:174)
at test.endtoend.Test038.doTests(Test038.java:58)
at test.endtoend.Test038.testGetParams(Test038.java:288)
at test.endtoend.Test038.main(Test038.java:303)
Oct 01, 2026 1:22:36 PM org.das2.jythoncompletion.DataSetUrlCompletionTask query
SEVERE: unable to find any files matching
vap+cdf:http://emfisis.physics.uiowa.edu/Flight/RBSP-A/Quick-Look/$Y/$m/$d/rbsp-a_magnetometer_uvw_emfisis-Quick-Look_$Y$m$d_v$(v,sep).cdf?timerange=%s&Mag[::%s]
java.io.FileNotFoundException: unable to find any files matching
vap+cdf:http://emfisis.physics.uiowa.edu/Flight/RBSP-A/Quick-Look/$Y/$m/$d/rbsp-a_magnetometer_uvw_emfisis-Quick-Look_$Y$m$d_v$(v,sep).cdf?timerange=%s&Mag[::%s]
at org.autoplot.aggregator.AggregatingDataSourceFactory.getDelegateDataSourceCompletionContext(AggregatingDataSourceFactory.java:230)
at org.autoplot.aggregator.AggregatingDataSourceFactory.getCompletions(AggregatingDataSourceFactory.java:358)
at org.autoplot.datasource.DataSetURI.getFactoryCompletions(DataSetURI.java:2404)
at org.autoplot.datasource.DataSetURI.getCompletions(DataSetURI.java:1652)
at org.das2.jythoncompletion.DataSetUrlCompletionTask.query(DataSetUrlCompletionTask.java:139)
at org.das2.jythoncompletion.JythonCompletionTask.queryStringLiteralArgument(JythonCompletionTask.java:1109)
at org.das2.jythoncompletion.JythonCompletionTask.doQuery(JythonCompletionTask.java:189)
at test.endtoend.Test038.getCompletionsCount(Test038.java:136)
at test.endtoend.Test038.doTestsCountCompletions(Test038.java:174)
at test.endtoend.Test038.doTests(Test038.java:58)
at test.endtoend.Test038.testGetParams(Test038.java:288)
at test.endtoend.Test038.main(Test038.java:303)
Oct 01, 2026 1:22:36 PM org.autoplot.datasource.DataSetURI getFileSystemCompletions
WARNING: parse exception: {0}
java.text.ParseException: failed attempt to parse int in "%s"
at org.das2.datum.DatumRangeUtil.parseInt(DatumRangeUtil.java:159)
at org.das2.datum.DatumRangeUtil.access$100(DatumRangeUtil.java:15)
at org.das2.datum.DatumRangeUtil$TimeRangeParser.parse(DatumRangeUtil.java:1224)
at org.das2.datum.DatumRangeUtil.parseTimeRange(DatumRangeUtil.java:1607)
at org.autoplot.datasource.DataSetURI.getFileSystemCompletions(DataSetURI.java:1971)
at org.autoplot.datasource.DataSetURI.getFileSystemCompletions(DataSetURI.java:1825)
at org.autoplot.datasource.DataSetURI.getCompletions(DataSetURI.java:1669)
at org.das2.jythoncompletion.DataSetUrlCompletionTask.query(DataSetUrlCompletionTask.java:139)
at org.das2.jythoncompletion.JythonCompletionTask.queryStringLiteralArgument(JythonCompletionTask.java:1109)
at org.das2.jythoncompletion.JythonCompletionTask.doQuery(JythonCompletionTask.java:189)
at test.endtoend.Test038.getCompletionsCount(Test038.java:136)
at test.endtoend.Test038.doTestsCountCompletions(Test038.java:174)
at test.endtoend.Test038.doTests(Test038.java:58)
at test.endtoend.Test038.testGetParams(Test038.java:288)
at test.endtoend.Test038.main(Test038.java:303)
Oct 01, 2026 1:22:36 PM org.das2.jythoncompletion.DataSetUrlCompletionTask query
SEVERE: null
java.lang.NullPointerException
Oct 01, 2026 1:22:36 PM org.autoplot.datasource.DataSetURI getFileSystemCompletions
WARNING: parse exception: {0}
java.text.ParseException: failed attempt to parse int in "%s"
at org.das2.datum.DatumRangeUtil.parseInt(DatumRangeUtil.java:159)
at org.das2.datum.DatumRangeUtil.access$100(DatumRangeUtil.java:15)
at org.das2.datum.DatumRangeUtil$TimeRangeParser.parse(DatumRangeUtil.java:1224)
at org.das2.datum.DatumRangeUtil.parseTimeRange(DatumRangeUtil.java:1607)
at org.autoplot.datasource.DataSetURI.getFileSystemCompletions(DataSetURI.java:1971)
at org.autoplot.datasource.DataSetURI.getFileSystemCompletions(DataSetURI.java:1825)
at org.autoplot.datasource.DataSetURI.getCompletions(DataSetURI.java:1669)
at org.das2.jythoncompletion.DataSetUrlCompletionTask.query(DataSetUrlCompletionTask.java:139)
at org.das2.jythoncompletion.JythonCompletionTask.queryStringLiteralArgument(JythonCompletionTask.java:1109)
at org.das2.jythoncompletion.JythonCompletionTask.doQuery(JythonCompletionTask.java:189)
at test.endtoend.Test038.getCompletionsCount(Test038.java:136)
at test.endtoend.Test038.doTestsCountCompletions(Test038.java:174)
at test.endtoend.Test038.doTests(Test038.java:58)
at test.endtoend.Test038.testGetParams(Test038.java:288)
at test.endtoend.Test038.main(Test038.java:303)
Oct 01, 2026 1:22:36 PM org.das2.jythoncompletion.DataSetUrlCompletionTask query
SEVERE: null
java.lang.NullPointerException
Oct 01, 2026 1:22:36 PM org.autoplot.datasource.DataSetURI getFileSystemCompletions
WARNING: parse exception: {0}
java.text.ParseException: failed attempt to parse int in "%s"
at org.das2.datum.DatumRangeUtil.parseInt(DatumRangeUtil.java:159)
at org.das2.datum.DatumRangeUtil.access$100(DatumRangeUtil.java:15)
at org.das2.datum.DatumRangeUtil$TimeRangeParser.parse(DatumRangeUtil.java:1224)
at org.das2.datum.DatumRangeUtil.parseTimeRange(DatumRangeUtil.java:1607)
at org.autoplot.datasource.DataSetURI.getFileSystemCompletions(DataSetURI.java:1971)
at org.autoplot.datasource.DataSetURI.getFileSystemCompletions(DataSetURI.java:1825)
at org.autoplot.datasource.DataSetURI.getCompletions(DataSetURI.java:1669)
at org.das2.jythoncompletion.DataSetUrlCompletionTask.query(DataSetUrlCompletionTask.java:139)
at org.das2.jythoncompletion.JythonCompletionTask.queryStringLiteralArgument(JythonCompletionTask.java:1109)
at org.das2.jythoncompletion.JythonCompletionTask.doQuery(JythonCompletionTask.java:189)
at test.endtoend.Test038.getCompletionsCount(Test038.java:136)
at test.endtoend.Test038.doTestsCountCompletions(Test038.java:174)
at test.endtoend.Test038.doTests(Test038.java:58)
at test.endtoend.Test038.testGetParams(Test038.java:288)
at test.endtoend.Test038.main(Test038.java:303)
Oct 01, 2026 1:22:36 PM org.das2.jythoncompletion.DataSetUrlCompletionTask query
SEVERE: null
java.lang.NullPointerException
Oct 01, 2026 1:22:36 PM org.autoplot.datasource.DataSetURI getFileSystemCompletions
WARNING: parse exception: {0}
java.text.ParseException: failed attempt to parse int in "%s"
at org.das2.datum.DatumRangeUtil.parseInt(DatumRangeUtil.java:159)
at org.das2.datum.DatumRangeUtil.access$100(DatumRangeUtil.java:15)
at org.das2.datum.DatumRangeUtil$TimeRangeParser.parse(DatumRangeUtil.java:1224)
at org.das2.datum.DatumRangeUtil.parseTimeRange(DatumRangeUtil.java:1607)
at org.autoplot.datasource.DataSetURI.getFileSystemCompletions(DataSetURI.java:1971)
at org.autoplot.datasource.DataSetURI.getFileSystemCompletions(DataSetURI.java:1825)
at org.autoplot.datasource.DataSetURI.getCompletions(DataSetURI.java:1669)
at org.das2.jythoncompletion.DataSetUrlCompletionTask.query(DataSetUrlCompletionTask.java:139)
at org.das2.jythoncompletion.JythonCompletionTask.queryStringLiteralArgument(JythonCompletionTask.java:1109)
at org.das2.jythoncompletion.JythonCompletionTask.doQuery(JythonCompletionTask.java:189)
at test.endtoend.Test038.getCompletionsCount(Test038.java:136)
at test.endtoend.Test038.doTestsCountCompletions(Test038.java:174)
at test.endtoend.Test038.doTests(Test038.java:58)
at test.endtoend.Test038.testGetParams(Test038.java:288)
at test.endtoend.Test038.main(Test038.java:303)
Oct 01, 2026 1:22:36 PM org.das2.jythoncompletion.DataSetUrlCompletionTask query
SEVERE: null
java.lang.NullPointerException
Oct 01, 2026 1:22:36 PM org.autoplot.datasource.DataSetURI getFileSystemCompletions
WARNING: parse exception: {0}
java.text.ParseException: failed attempt to parse int in "%s"
at org.das2.datum.DatumRangeUtil.parseInt(DatumRangeUtil.java:159)
at org.das2.datum.DatumRangeUtil.access$100(DatumRangeUtil.java:15)
at org.das2.datum.DatumRangeUtil$TimeRangeParser.parse(DatumRangeUtil.java:1224)
at org.das2.datum.DatumRangeUtil.parseTimeRange(DatumRangeUtil.java:1607)
at org.autoplot.datasource.DataSetURI.getFileSystemCompletions(DataSetURI.java:1971)
at org.autoplot.datasource.DataSetURI.getFileSystemCompletions(DataSetURI.java:1825)
at org.autoplot.datasource.DataSetURI.getCompletions(DataSetURI.java:1669)
at org.das2.jythoncompletion.DataSetUrlCompletionTask.query(DataSetUrlCompletionTask.java:139)
at org.das2.jythoncompletion.JythonCompletionTask.queryStringLiteralArgument(JythonCompletionTask.java:1109)
at org.das2.jythoncompletion.JythonCompletionTask.doQuery(JythonCompletionTask.java:189)
at test.endtoend.Test038.getCompletionsCount(Test038.java:136)
at test.endtoend.Test038.doTestsCountCompletions(Test038.java:174)
at test.endtoend.Test038.doTests(Test038.java:58)
at test.endtoend.Test038.testGetParams(Test038.java:288)
at test.endtoend.Test038.main(Test038.java:303)
Oct 01, 2026 1:22:36 PM org.das2.jythoncompletion.DataSetUrlCompletionTask query
SEVERE: null
java.lang.NullPointerException
Oct 01, 2026 1:22:36 PM org.das2.jythoncompletion.DataSetUrlCompletionTask query
SEVERE: unable to find any files matching
vap+cdf:http://emfisis.physics.uiowa.edu/Flight/RBSP-A/Quick-Look/$Y/$m/$d/rbsp-a_magnetometer_uvw_emfisis-Quick-Look_$Y$m$d_v$(v,sep).cdf?timerange=%s&Mag[::%s]
java.io.FileNotFoundException: unable to find any files matching
vap+cdf:http://emfisis.physics.uiowa.edu/Flight/RBSP-A/Quick-Look/$Y/$m/$d/rbsp-a_magnetometer_uvw_emfisis-Quick-Look_$Y$m$d_v$(v,sep).cdf?timerange=%s&Mag[::%s]
at org.autoplot.aggregator.AggregatingDataSourceFactory.getDelegateDataSourceCompletionContext(AggregatingDataSourceFactory.java:230)
at org.autoplot.aggregator.AggregatingDataSourceFactory.getCompletions(AggregatingDataSourceFactory.java:358)
at org.autoplot.datasource.DataSetURI.getFactoryCompletions(DataSetURI.java:2404)
at org.autoplot.datasource.DataSetURI.getCompletions(DataSetURI.java:1652)
at org.das2.jythoncompletion.DataSetUrlCompletionTask.query(DataSetUrlCompletionTask.java:139)
at org.das2.jythoncompletion.JythonCompletionTask.queryStringLiteralArgument(JythonCompletionTask.java:1109)
at org.das2.jythoncompletion.JythonCompletionTask.doQuery(JythonCompletionTask.java:189)
at test.endtoend.Test038.getCompletionsCount(Test038.java:136)
at test.endtoend.Test038.doTestsCountCompletions(Test038.java:174)
at test.endtoend.Test038.doTests(Test038.java:58)
at test.endtoend.Test038.testGetParams(Test038.java:288)
at test.endtoend.Test038.main(Test038.java:303)
Oct 01, 2026 1:22:36 PM org.autoplot.datasource.DataSetURI getFileSystemCompletions
WARNING: parse exception: {0}
java.text.ParseException: failed attempt to parse int in "%s"
at org.das2.datum.DatumRangeUtil.parseInt(DatumRangeUtil.java:159)
at org.das2.datum.DatumRangeUtil.access$100(DatumRangeUtil.java:15)
at org.das2.datum.DatumRangeUtil$TimeRangeParser.parse(DatumRangeUtil.java:1224)
at org.das2.datum.DatumRangeUtil.parseTimeRange(DatumRangeUtil.java:1607)
at org.autoplot.datasource.DataSetURI.getFileSystemCompletions(DataSetURI.java:1971)
at org.autoplot.datasource.DataSetURI.getFileSystemCompletions(DataSetURI.java:1825)
at org.autoplot.datasource.DataSetURI.getCompletions(DataSetURI.java:1669)
at org.das2.jythoncompletion.DataSetUrlCompletionTask.query(DataSetUrlCompletionTask.java:139)
at org.das2.jythoncompletion.JythonCompletionTask.queryStringLiteralArgument(JythonCompletionTask.java:1109)
at org.das2.jythoncompletion.JythonCompletionTask.doQuery(JythonCompletionTask.java:189)
at test.endtoend.Test038.getCompletionsCount(Test038.java:136)
at test.endtoend.Test038.doTestsCountCompletions(Test038.java:174)
at test.endtoend.Test038.doTests(Test038.java:58)
at test.endtoend.Test038.testGetParams(Test038.java:288)
at test.endtoend.Test038.main(Test038.java:303)
Oct 01, 2026 1:22:36 PM org.das2.jythoncompletion.DataSetUrlCompletionTask query
SEVERE: null
java.lang.NullPointerException
Oct 01, 2026 1:22:36 PM org.autoplot.datasource.DataSetURI getFileSystemCompletions
WARNING: parse exception: {0}
java.text.ParseException: failed attempt to parse int in "%s"
at org.das2.datum.DatumRangeUtil.parseInt(DatumRangeUtil.java:159)
at org.das2.datum.DatumRangeUtil.access$100(DatumRangeUtil.java:15)
at org.das2.datum.DatumRangeUtil$TimeRangeParser.parse(DatumRangeUtil.java:1224)
at org.das2.datum.DatumRangeUtil.parseTimeRange(DatumRangeUtil.java:1607)
at org.autoplot.datasource.DataSetURI.getFileSystemCompletions(DataSetURI.java:1971)
at org.autoplot.datasource.DataSetURI.getFileSystemCompletions(DataSetURI.java:1825)
at org.autoplot.datasource.DataSetURI.getCompletions(DataSetURI.java:1669)
at org.das2.jythoncompletion.DataSetUrlCompletionTask.query(DataSetUrlCompletionTask.java:139)
at org.das2.jythoncompletion.JythonCompletionTask.queryStringLiteralArgument(JythonCompletionTask.java:1109)
at org.das2.jythoncompletion.JythonCompletionTask.doQuery(JythonCompletionTask.java:189)
at test.endtoend.Test038.getCompletionsCount(Test038.java:136)
at test.endtoend.Test038.doTestsCountCompletions(Test038.java:174)
at test.endtoend.Test038.doTests(Test038.java:58)
at test.endtoend.Test038.testGetParams(Test038.java:288)
at test.endtoend.Test038.main(Test038.java:303)
Oct 01, 2026 1:22:36 PM org.das2.jythoncompletion.DataSetUrlCompletionTask query
SEVERE: null
java.lang.NullPointerException
Oct 01, 2026 1:22:36 PM org.autoplot.datasource.DataSetURI getFileSystemCompletions
WARNING: parse exception: {0}
java.text.ParseException: failed attempt to parse int in "%s"
at org.das2.datum.DatumRangeUtil.parseInt(DatumRangeUtil.java:159)
at org.das2.datum.DatumRangeUtil.access$100(DatumRangeUtil.java:15)
at org.das2.datum.DatumRangeUtil$TimeRangeParser.parse(DatumRangeUtil.java:1224)
at org.das2.datum.DatumRangeUtil.parseTimeRange(DatumRangeUtil.java:1607)
at org.autoplot.datasource.DataSetURI.getFileSystemCompletions(DataSetURI.java:1971)
at org.autoplot.datasource.DataSetURI.getFileSystemCompletions(DataSetURI.java:1825)
at org.autoplot.datasource.DataSetURI.getCompletions(DataSetURI.java:1669)
at org.das2.jythoncompletion.DataSetUrlCompletionTask.query(DataSetUrlCompletionTask.java:139)
at org.das2.jythoncompletion.JythonCompletionTask.queryStringLiteralArgument(JythonCompletionTask.java:1109)
at org.das2.jythoncompletion.JythonCompletionTask.doQuery(JythonCompletionTask.java:189)
at test.endtoend.Test038.getCompletionsCount(Test038.java:136)
at test.endtoend.Test038.doTestsCountCompletions(Test038.java:174)
at test.endtoend.Test038.doTests(Test038.java:58)
at test.endtoend.Test038.testGetParams(Test038.java:288)
at test.endtoend.Test038.main(Test038.java:303)
Oct 01, 2026 1:22:36 PM org.das2.jythoncompletion.DataSetUrlCompletionTask query
SEVERE: null
java.lang.NullPointerException
Oct 01, 2026 1:22:36 PM org.autoplot.datasource.DataSetURI getFileSystemCompletions
WARNING: parse exception: {0}
java.text.ParseException: failed attempt to parse int in "%s"
at org.das2.datum.DatumRangeUtil.parseInt(DatumRangeUtil.java:159)
at org.das2.datum.DatumRangeUtil.access$100(DatumRangeUtil.java:15)
at org.das2.datum.DatumRangeUtil$TimeRangeParser.parse(DatumRangeUtil.java:1224)
at org.das2.datum.DatumRangeUtil.parseTimeRange(DatumRangeUtil.java:1607)
at org.autoplot.datasource.DataSetURI.getFileSystemCompletions(DataSetURI.java:1971)
at org.autoplot.datasource.DataSetURI.getFileSystemCompletions(DataSetURI.java:1825)
at org.autoplot.datasource.DataSetURI.getCompletions(DataSetURI.java:1669)
at org.das2.jythoncompletion.DataSetUrlCompletionTask.query(DataSetUrlCompletionTask.java:139)
at org.das2.jythoncompletion.JythonCompletionTask.queryStringLiteralArgument(JythonCompletionTask.java:1109)
at org.das2.jythoncompletion.JythonCompletionTask.doQuery(JythonCompletionTask.java:189)
at test.endtoend.Test038.getCompletionsCount(Test038.java:136)
at test.endtoend.Test038.doTestsCountCompletions(Test038.java:174)
at test.endtoend.Test038.doTests(Test038.java:58)
at test.endtoend.Test038.testGetParams(Test038.java:288)
at test.endtoend.Test038.main(Test038.java:303)
Oct 01, 2026 1:22:36 PM org.das2.jythoncompletion.DataSetUrlCompletionTask query
SEVERE: null
java.lang.NullPointerException
Oct 01, 2026 1:22:36 PM org.das2.jythoncompletion.DataSetUrlCompletionTask query
SEVERE: unable to find any files matching
vap+cdf:http://emfisis.physics.uiowa.edu/Flight/RBSP-A/Quick-Look/$Y/$m/$d/rbsp-a_magnetometer_uvw_emfisis-Quick-Look_$Y$m$d_v$(v,sep).cdf?timerange=%s&Mag[::%s]
java.io.FileNotFoundException: unable to find any files matching
vap+cdf:http://emfisis.physics.uiowa.edu/Flight/RBSP-A/Quick-Look/$Y/$m/$d/rbsp-a_magnetometer_uvw_emfisis-Quick-Look_$Y$m$d_v$(v,sep).cdf?timerange=%s&Mag[::%s]
at org.autoplot.aggregator.AggregatingDataSourceFactory.getDelegateDataSourceCompletionContext(AggregatingDataSourceFactory.java:230)
at org.autoplot.aggregator.AggregatingDataSourceFactory.getCompletions(AggregatingDataSourceFactory.java:358)
at org.autoplot.datasource.DataSetURI.getFactoryCompletions(DataSetURI.java:2404)
at org.autoplot.datasource.DataSetURI.getCompletions(DataSetURI.java:1652)
at org.das2.jythoncompletion.DataSetUrlCompletionTask.query(DataSetUrlCompletionTask.java:139)
at org.das2.jythoncompletion.JythonCompletionTask.queryStringLiteralArgument(JythonCompletionTask.java:1109)
at org.das2.jythoncompletion.JythonCompletionTask.doQuery(JythonCompletionTask.java:189)
at test.endtoend.Test038.getCompletionsCount(Test038.java:136)
at test.endtoend.Test038.doTestsCountCompletions(Test038.java:174)
at test.endtoend.Test038.doTests(Test038.java:58)
at test.endtoend.Test038.testGetParams(Test038.java:288)
at test.endtoend.Test038.main(Test038.java:303)
Oct 01, 2026 1:22:36 PM org.das2.jythoncompletion.DataSetUrlCompletionTask query
SEVERE: unable to find any files matching
vap+cdf:http://emfisis.physics.uiowa.edu/Flight/RBSP-A/Quick-Look/$Y/$m/$d/rbsp-a_magnetometer_uvw_emfisis-Quick-Look_$Y$m$d_v$(v,sep).cdf?timerange=%s&Mag[::%s]
java.io.FileNotFoundException: unable to find any files matching
vap+cdf:http://emfisis.physics.uiowa.edu/Flight/RBSP-A/Quick-Look/$Y/$m/$d/rbsp-a_magnetometer_uvw_emfisis-Quick-Look_$Y$m$d_v$(v,sep).cdf?timerange=%s&Mag[::%s]
at org.autoplot.aggregator.AggregatingDataSourceFactory.getDelegateDataSourceCompletionContext(AggregatingDataSourceFactory.java:230)
at org.autoplot.aggregator.AggregatingDataSourceFactory.getCompletions(AggregatingDataSourceFactory.java:358)
at org.autoplot.datasource.DataSetURI.getFactoryCompletions(DataSetURI.java:2404)
at org.autoplot.datasource.DataSetURI.getCompletions(DataSetURI.java:1652)
at org.das2.jythoncompletion.DataSetUrlCompletionTask.query(DataSetUrlCompletionTask.java:139)
at org.das2.jythoncompletion.JythonCompletionTask.queryStringLiteralArgument(JythonCompletionTask.java:1109)
at org.das2.jythoncompletion.JythonCompletionTask.doQuery(JythonCompletionTask.java:189)
at test.endtoend.Test038.getCompletionsCount(Test038.java:136)
at test.endtoend.Test038.doTestsCountCompletions(Test038.java:174)
at test.endtoend.Test038.doTests(Test038.java:58)
at test.endtoend.Test038.testGetParams(Test038.java:288)
at test.endtoend.Test038.main(Test038.java:303)
overwriting /var/local/jenkins/workspace/autoplot-test038/test038.fce_A_2.jyds.cdf
overwriting /var/local/jenkins/workspace/autoplot-test038/test038.fce_A_2.jyds.cdf
overwriting /var/local/jenkins/workspace/autoplot-test038/test038.fce_A_2.jyds.cdf
== test 110: /home/jbf/ct/hudson/script/test038/addPointDigitizer.jy ==
mode=LFRH
svybst=surveyall
reduce=1s
newVersion=1
read params in 10 millis: /home/jbf/ct/hudson/script/test038/addPointDigitizer.jy
== test 110: /home/jbf/ct/hudson/script/test038/addPointDigitizer.jy ==
mode=LFRH
svybst=surveyall
reduce=1s
newVersion=1
read params in 8 millis: /home/jbf/ct/hudson/script/test038/addPointDigitizer.jy
== test 110: /home/jbf/ct/hudson/script/test038/addPointDigitizer.jy ==
overwriting /var/local/jenkins/workspace/autoplot-test038/test038.addPointDigitizer.jy.cdf
overwriting /var/local/jenkins/workspace/autoplot-test038/test038.addPointDigitizer.jy.cdf
overwriting /var/local/jenkins/workspace/autoplot-test038/test038.addPointDigitizer.jy.cdf
== test 111: /home/jbf/ct/hudson/script/test038/rewriteF_L0.jy ==
Traceback (innermost last):
(no code object) at line 0
File "<string>", line 7
fln = split.file[<UNSUPPORTED:Slice>]
^
SyntaxError: invalid syntax
*** failed within 17 millis: /home/jbf/ct/hudson/script/test038/rewriteF_L0.jy
== test 111: /home/jbf/ct/hudson/script/test038/rewriteF_L0.jy ==
Traceback (innermost last):
(no code object) at line 0
File "<string>", line 7
fln = split.file[<UNSUPPORTED:Slice>]
^
SyntaxError: invalid syntax
*** failed within 16 millis: /home/jbf/ct/hudson/script/test038/rewriteF_L0.jy
== test 111: /home/jbf/ct/hudson/script/test038/rewriteF_L0.jy ==
overwriting /var/local/jenkins/workspace/autoplot-test038/test038.rewriteF_L0.jy.cdf
overwriting /var/local/jenkins/workspace/autoplot-test038/test038.rewriteF_L0.jy.cdf
overwriting /var/local/jenkins/workspace/autoplot-test038/test038.rewriteF_L0.jy.cdf
Reading tests from file: /home/jbf/ct/hudson/script/test038/test038.txt
== test 101: /home/jbf/ct/autoplot/git/dev/bugs/2019/20190427/exDataSets.jyds ==
scheme=scatter
n=1000000
seed=5334
mod=F
read params in 13 millis: /home/jbf/ct/autoplot/git/dev/bugs/2019/20190427/exDataSets.jyds
== test 101: /home/jbf/ct/autoplot/git/dev/bugs/2019/20190427/exDataSets.jyds ==
scheme=scatter
n=1000000
seed=5334
mod=F
read params in 10 millis: /home/jbf/ct/autoplot/git/dev/bugs/2019/20190427/exDataSets.jyds
== test 101: /home/jbf/ct/autoplot/git/dev/bugs/2019/20190427/exDataSets.jyds ==
overwriting /var/local/jenkins/workspace/autoplot-test038/test038.exDataSets.jyds.cdf
overwriting /var/local/jenkins/workspace/autoplot-test038/test038.exDataSets.jyds.cdf
overwriting /var/local/jenkins/workspace/autoplot-test038/test038.exDataSets.jyds.cdf
Oct 01, 2026 1:22:50 PM org.autoplot.ScriptContext$1 uncaughtException
SEVERE: runtime exception: java.lang.IllegalStateException: at least one of the tests failed.
java.lang.IllegalStateException: at least one of the tests failed.
at test.endtoend.Test038.main(Test038.java:307)
Oct 01, 2026 1:22:50 PM org.autoplot.scriptconsole.ExitExceptionHandler handleUncaught
WARNING: uncaught exception occurred: at least one of the tests failed.
java.lang.IllegalStateException: at least one of the tests failed.
at test.endtoend.Test038.main(Test038.java:307)
java.lang.IllegalStateException: at least one of the tests failed.
at test.endtoend.Test038.main(Test038.java:307)
Build step 'Execute shell' marked build as failure
Archiving artifacts
Finished: FAILURE